Fedora :: Compiling Code - Failing Sanity Check

Dec 7, 2009

Keep receiving the following error message when i try to compile any code:
checking how to run the C++ preprocessor... /lib/cpp
configure: error: C++ preprocessor "/lib/cpp" fails sanity check
logs test out some code with the C preprocessor and fail, thereby failing the "sanity check" I reinstalled cpp, but to no avail.

View 1 Replies


General :: Tools To Check An HD For Sanity?

Sep 10, 2010

Updating my kernel corrupted grub preventing me from booting. Running the grub shell to restore the primary stage bootloader, restored bootability. It is important to note, that several months ago, I had a similar failure that corrupted the MBR.Are there any Linux based tools to check an HD for sanity? By the latter I am not only understanding software integrity but also hardware sanity.

View 1 Replies View Related

General :: Lib/cpp Fails Sanity Check?

Mar 17, 2010

am trying to build some programs like lmms or qtraktorbut I often get the reported erro

View 3 Replies View Related

Programming :: C Preprocessor Fails Sanity Check?

Jan 31, 2010

Recently, every time I try to compile an app from its source code, after issuing the ./configure command I get this message:configure: error: C preprocessor "/lib/cpp" fails sanity checkSee `config.log' for more details.I check /lib/cpp but there is not directory named /cpp under /libthis problem occurs on all source packages.

View 3 Replies View Related

Software :: Gcc Sanity Check Fails After Restore Tar Backup?

Jul 2, 2010

is I've restored a tar.bz2 backup I've made, all fine until it comes to configure/make.the backup was made on my laptop, the transferred to another computer, I used tarxvpf filename
and sure backup was madetar -zcvpf filename / (--exclude=dev etc)dist is lfs,he laptopstill works fine, file date, size, mods all the same so quite pu as to way I get"/lib/gcc failed sanity check"when running .configurep.s. laptop and computer both based

View 2 Replies View Related

Software :: C Preprocessor /lib/cpp Fails Sanity Check - Every Single Time

Aug 3, 2010

I have no idea what I've done but I can't compile from source anymore.
VectorLinux standard 6.0

everything I try to compile fails at ./configure with an error :


The content of config.log: (kinda long)


This file contains any messages produced by compilers while running configure, to aid debugging if configure makes a mistake.

It was created by mpc configure 0.8.2, which was generated by GNU Autoconf 2.65.

Invocation command line was:

configure: exit 1

I was intending to recompile gcc from source instead of the the one came with the distro, but to do so I need MPC, which I can't compile.

View 18 Replies View Related

Ubuntu Installation :: /usr/lib/libgconf2-4/gconf-sanity-check-2 Exited With Error Status 256

Sep 6, 2010

yesterday i tried to install bt4 from alongside ubuntu 10.04. Unfortunately the DVD had some errors and the installation stopped. Everything was fine till then, even the GRUB was working(i guess!) but when i tried to log into my Ubuntu it gave me an error... " /usr/lib/libgconf2-4/gconf-sanity-check-2 exited with error status 256" also there was a popup like "gnome power management was not properly installed ....blah blah blah Contact you network admin"

i have only one user on that system. i tried the single user mode but no success... i then tried to Ctrl+Alt+F1-F6 no success... can't switch to command line(this is my display problem i guess)

i have now decided to install a fresh install but i do need to take the backup. What all should i copy to the new install so that i get the same feel as before?

View 1 Replies View Related

Ubuntu :: Error After Updates - Gconf-sanity-check-2 Exited With Status 32512

Jul 22, 2011

I ran update through the terminal and rebooted i get this error message on start up and again after I log in Please Help!! I'm running Ubuntu 11.04 using unity 2d and the latest version of Gnome 2 on a Dell Inspiron 5150 laptop There is a problem with the configuration server. (/usr/lib/libgconf2-4/gconf-sanity-check-2 exited with status 32512)

View 5 Replies View Related

General :: Configure: Error: C++ Preprocessor "/lib/cpp" Fails Sanity Check

Jan 1, 2011

when trying to install a tarball i am getting the following error when configuring:

configure: error: in `/home/server/tazzed/mkahawa-printer-0.0.1':
configure: error: C++ preprocessor "/lib/cpp" fails sanity check

View 2 Replies View Related

OpenSUSE Install :: Not Working Right - Error "There Is A Problem With The Configuration Server (/usr/lib/Gconf-sanity- Check - 2 Exited With Status 256"

Jun 20, 2011

Having downloaded 11.4 Gnome, finding it did not install I bought it on DVD from ebay, when trying DVD installation my PC is displaying: There is a problem with the configuration server (/usr/lib/Gconf-sanity- check - 2 exited with status 256, I would like to install this rather then just run it off disk

View 9 Replies View Related

Programming :: Typeset -i Failing And Return Exit Code 1

Nov 18, 2010

I have this command in ksh:

1. typeset -i INTEGER INTEGER=aaa In all platforms except of Linux it is failing and return exit code 1 Why in Linux it is not failing? I must it for my number tests

2. The same for printf command. Only in Linux the bellow command is not failing: printf "%d" aaa

View 7 Replies View Related

OpenSUSE :: Compiling A Code On 32-bit 11.1?

Dec 27, 2010

I tried to compiling a code on 32-bit OpenSuSe 11.1, but it was terminated with following error: # ***No rule to make target '/usr/lib/libGLU.a', needed by 'DXA_debug'. Stop Then I installed the freeglut-2.6.0, but there were only libGLU.so and libGLU.so.1 in /usr/lib folder. And the compiling process was terminated with the same error. Will you give me some instruction to solve this problem?

View 3 Replies View Related

General :: Code Tarball Build Failing In Gnaupps (coreutils, Grep) On A FC7?

Mar 17, 2010

I am not sure which thread this fits in, I am facing a strange problem. There is a code tarball that I cross-compile on a Fedora Core 9 machine and it builds fine. But when I do the same thing on a (heavily used) Fedora Core 7 machine, the build keeps failing in the gnuapp folders grep, coreutils etc. I have tried 'make distclean', and clearing the config.cache but no impact.

Note: I export the PATH variable (to the local cross-compiler) before starting the build. The cross compilation is for the MIPS processor and GNU makefiles are used.

View 1 Replies View Related

Ubuntu Installation :: Code: Blocks Not Compiling

Jan 25, 2010

so I just installed code blocks after clear installing ubuntu 64 everything went fine but when I try to compile and run my .cpp files code::blocks wont do anything I dont get any messages on the build log so I dont understand whats happening I tried looking on the forums and checking other pages such as the one bellow but no luck at all. [URL]

View 1 Replies View Related

General :: Compiling Fortran Code In SuSe 11.3

May 18, 2011

I can compile an old fortran program on my macbook using the Absoft fortran compiler and the command:f90 'W132 C SOURCECODE.flU77lV77

Unfortunately I cannot find f90 for linux. I can, however, find gfortran. However, gfortran does not recognize the flag -W132 and when I remove -W132 the compiler thinks all lines end after a certain number of characters. Does anyone know what flags call the equivalent type of compilation using gfortran? Is it possible I need to use f90? If so, is there a free version of f90 for linux?

View 8 Replies View Related

Fedora :: Source Code For Open Office, "spell Check"?

Feb 21, 2011

want the source code for open office, "spell check" where i can find those?

View 2 Replies View Related

Programming :: Error Messages Generated When Compiling C++ Code?

Jul 3, 2010

Is there an online resource to lookup error messages generated when compiling C++ code?

View 5 Replies View Related

Software :: Compiling Code - Linking To Libraries Using Different Versions Of C++ Runtime?

May 19, 2011

Basically, I'm trying to compile program A, which depends on LibA and LibB. LibA would not build with my version of G++ 4.4.3 due to a bug, so I've compiled the latest G++ 4.5 (installed in /opt directory) and built that library successfully (also installed in /opt).

I have LibB on my system already, but it was built with the 4.4.3 version. When compiling my final program, am I going to have issues because the .so files were built with different versions of gcc/g++? Or should I just rebuild a special version of LibB with the later version of the compiler just for that program? I can proceed and just see what happens, but I'm a little confused about how things work in a situation like this.

View 2 Replies View Related

Software :: Compiling Evince From Source Code - Make Errors

Mar 20, 2011

When I compile evince from its source code, I am able to run ./configure properly, but when I run make the following output is displayed.

make all-recursive
make[1]: Entering directory `/media/New_Volume/untitled folder/evince-2.32.0'
Making all in cut-n-paste
make[2]: Entering directory `/media/New_Volume/untitled folder/evince-2.32.0/cut-n-paste'
Making all in zoom-control
make[3]: Entering directory `/media/New_Volume/untitled folder/evince-2.32.0/cut-n-paste/zoom-control' .....
make[3]: *** [libevview.la] Error 1
make[2]: *** [all] Error 2
make[1]: *** [all-recursive] Error 1
make: *** [all] Error 2

I am not able to ascertain the source of this error, even though I seem to have the file in question-libevdocument.la. What do I do now to remove this error?

View 8 Replies View Related

Programming :: Valac: Compiling Into C Code: Expected Semicolon In The Wrong Place

Oct 20, 2010

Here is my problem: I have a Vala program that includes classes with nested classes. When I try to initialize classes (using the variable type and the variable, followed by the class's arguments [three unsigned 8-bit integers] in parentheses) and try to compile the Vala code to C code what I tried to AVOID doing, as I really wanted to create a shared object file, but now I know I have to use C code as a middleman, the compiler tells me it expects a semicolon between the class variable name and its members.

What?! A semicolon in a bad place, that's for sure! Why would I want to put a semicolon *BETWEEN* the class initialization and its members? Isn't the whole point of a class to *HAVE* different members? Here is my class:

public class Gtk.rgba : GLib.Object {
public class fg_color : GLib.Object {
private uint8 red;
private uint8 green;
private uint8 blue;
public fg_color(uint8 r, uint8 g, uint8 b) {

View 14 Replies View Related

Ubuntu :: Fatal Error: Iostream.h: No Such File Or Directory Compilation Terminated While Compiling C++ Code

Dec 9, 2010

whenever i am trying to compile a c++ program i am getting the following error sample.cpp:1: fatal error: iostream.h: No such file or directory compilation terminated

View 1 Replies View Related

Ubuntu :: Can't Check Out Code From Bazaar / Enable This?

Jul 9, 2010


My proxy is turned off. There is no local proxy as far as I can see. Anyone see this before? Is it my ISP?

UPDATE: I was wrong, forgot about an old proxychains setting which redirected ssh traffic via a proxy on port 22.

View 1 Replies View Related

General :: Check DVD Region Code From Command Line?

May 3, 2010

Is there a way to get DVD region code from command line (linux/ubuntu 9.10)? I want to script this action and store the region code (and other data about DVD) in a log.

I am looking for the info about media, not the drive.

View 1 Replies View Related

Ubuntu :: Check Or Uncheck Boxes That Say 'Source Code' In Software Sources Window?

Nov 7, 2010

Should I check or uncheck boxes that say 'Source Code' in Software Sources window?

View 3 Replies View Related

Ubuntu :: Compiling Source Code Error "You Need Intltool 0.40.0 Or Later"?

Jun 5, 2011

Just switched over to Ubuntu 11.04 32bit. I have spent the day configuring it to my likings, and am content with Ubuntu. I have zero experience with coding, and bare minimum knowledge. Anyways, I have gotten some tar.gz files, that I have extracted them into folders, and then in terminal I run ./configure, and then I get the error "You need intltool 0.40.0 or later".

View 2 Replies View Related

OpenSUSE :: Compiling Java Code Error "undefined Reference To Main"

Aug 9, 2011

After messing up with grub, I reformatted my hdd and installed opensuse 11.4 (gnome+kde) from the dvd and also included the java sdk while installing, now the problem is that whenever i compile a java program, I get this error Code: /usr/src/packages/BUILD/glibc-2.11.3/csu/../sysdeps/x86_64/elf/start.S:109: undefined reference to `main'

View 3 Replies View Related

Debian Multimedia :: Squeeze Compiling Dwm From Debian Source / Reality Check

Aug 18, 2011

Below is the recipe I've used to compile dwm from source on Squeeze

apt-get install devscripts debian-keyring
apt-get build-dep dwm

It all seems to work, however debuild gave an error about secret keys. Is this a sensible procedure? What happens in the (probably unlikely) event there is another source patch?I've gone to a tiling window manager as the result of the purchase of a wide screen LCD monitor. I like to have some stuff down the right hand side when running Firefox and OpenOffice in the main panes. Any configuration tricks welcome. Modern screens are the wrong shape!

View 6 Replies View Related

Fedora :: Ipv6 Failing / Why Is So?

Jan 20, 2010

I am new here and Fedora. Currently running Fedora 12 and recieved kernel crashes to which error report shows failure with IPv6.

I have disabled Ipv6 in /etc/sysconfig/network, blacklisted and stop these services.

However why is my Ipv6 failing?

View 2 Replies View Related

Red Hat / Fedora :: Finch Failing On The 6?

Jan 12, 2010

I am trying to run finch on fedora6. Finch is exiting immediately on starting and i am not able to add any account using it. correct procedure to use finch.

View 5 Replies View Related

Fedora :: Appearance Failing To Open?

Feb 21, 2010

When I go to Administration->Preferences->Appearance, the window pops up for a split second and is then gone. Attempting to open it again yields the same result. I have never had this issue before and haven't changed anything recently that I recall.

View 8 Replies View Related

Copyrights 2005-15 www.BigResource.com, All rights reserved