Ubuntu Multimedia :: VLC Compiling / Link Error

Mar 10, 2010

I tried to compile the latest VLC as the instruction of [URL]... except that giving configure option '--enable-vaapi' when compiling ffmpeg.But, i got below error messages, and don't know what to do. My system is as follows.

[code]...

View 5 Replies


ADVERTISEMENT

Ubuntu Multimedia :: M650 Driver Compiling Error 2

Sep 11, 2010

I know Ive been a lil redundant, there are a lot that has been said about this cam, some made them work, others not. My point is, I haven't. Once it worked, about 2 years ago, but suddenly after the Jaunty updates it has stopped.

Here is my output from make:

Quote:

View 1 Replies View Related

Debian Multimedia :: Error When Compiling Wine

Apr 21, 2011

I'm trying to build a package from wine 1.3.18 following Soul Singin's post here but it gives me this error.

wine: configuration in '/home/user/.wine' has been updated.
wine: cannot find L"unix\tmp\wine-1.3.18\dlls\advapi32\tests\advapi32_test.exe.so"
make[2]: *** [cred.ok] Error 2
make[2]: Leaving directory `/tmp/wine-1.3.18/dlls/advapi32/tests'

[Code].....

This error only appear when I use dpkg-buildpackage not when I compile the source it with make.

View 1 Replies View Related

Ubuntu :: Lucid Apache2 Directory Symlink Error "Symbolic Link Not Allowed Or Link Target Not Accessible"

Jun 2, 2010

There is a symlink from /var/www to a personal directory. FollowSymlink and chmod 755 are all set. It works perfectly until each morning I will get a "Symbolic link not allowed or link target not accessible" error. When I do a "sudo service apache2 restart", the problem will go away.

View 1 Replies View Related

Ubuntu :: Link To File On The Host System - Error "Invalid Cross-device Link"

Oct 25, 2010

I installed 10.10 using wubi (Host system is Win XP). I want to create a symbolic link of a file on the host system (Windows c:abc.doc file) in my Ubuntu home ~/ directory.
When I type command ln /host/abc.doc abc.doc It gives me following error ln: creating hard link `abc.doc' => `/host/abc.doc': Invalid cross-device link

View 1 Replies View Related

Ubuntu :: Error While Compiling Xchat

Jan 26, 2010

I am compiling Xchat and when I was 'make install' I get this error and yes I am root.

Code:
make[2]: *** [fe-gtk.o] Error 1
make[2]: Leaving directory `/home/mark/build/xchat-2.8.6/src/fe-gtk'
make[1]: *** [install-recursive] Error 1
make[1]: Leaving directory `/home/mark/build/xchat-2.8.6/src'
make: *** [install-recursive] Error 1

View 3 Replies View Related

Ubuntu :: Getting Error In Compiling RPC Program

Mar 22, 2010

I am trying to compile a simple remote procedure call program. I am getting an error:
/tmp/ccy0M5rT.o: In function 'main':
rpchighlayer.c.text+0x5c): undefined reference to 'rnusers'
collect2: ld returned 1 exit status

Code:
#include <stdio.h>
#include<stdlib.h>
main(argc, argv)
int argc;
char **argv; {
int num;if (argc != 2) {
fprintf(stderr, "usage: rnusers hostname ");
exit(1);
} if ((num = rnusers(argv[1])) < 0)
{fprintf(stderr, "error: rnusers ");
exit(-1);
} printf("%d users on %s
", num, argv[1]);
exit(0); }

View 2 Replies View Related

Ubuntu :: Getting Error While Compiling A C Program / Fix It?

Mar 10, 2010

I got an error that header file sys/ddi.h , did the system is missing something

View 2 Replies View Related

Programming :: Getting Error While Compiling In Gambas On Ubuntu

Sep 5, 2010

Geting the following error while compiling in gambas on ubuntu. What is a secret key ?

[code]...

View 2 Replies View Related

Fedora :: Error Compiling 2.6.33.2

Apr 7, 2010

I am trying to compile kernel 2.6.33.2 (without problems 2.6.33.1), but i got the following message :

[code]...

View 2 Replies View Related

Debian :: Error Compiling 2.6.33.2

Apr 11, 2010

Im having problem compiling kernel I used these commands

#make menuconfig
#make-kpkg clean
#fakeroot make-kpkg --revision=custom.1.0 kernel_image

[code]...

View 3 Replies View Related

Software :: Error Compiling 2.6.33.2

Apr 9, 2010

My system is a fc 12 using a 2.6.33.1 kernel from kernel.org ... i've prefer compile by myself to get a minimal kernel ( i got a old p4 a 1,6ghz 2gb ram) but i got fedora kernels from updates too I am trying to compile a kernel from www.kernel.org, linux-2.6.33.2 full .. i made the same with 2.6.33.1 and all ok I got kernels from fedora distro (kernel-devel and kernel-headers installed) and kernel.org I dont know why about directory paths and files ... why make finds it? ... i think that linux-2.6.33.2.bz2 include all needed how to configure the install path ? ... if i am using /usr/src/kernels/linux-2.6.33.2 and all bzip2 extracted into it ... i can't see "configure" tool I am trying to compile kernel 2.6.33.2 (without problems 2.6.33.1), but i got the following message :

[code]....

View 5 Replies View Related

Software :: Ns2 Error While Compiling?

Feb 9, 2011

i encountered this problem when compling the tcl code, i am not sure where went wrong, did i miss any library or component?

num_nodes is set 20
INITIALIZE THE LIST xListHead
invalid command name "Agent/UDP/PDP"
while executing
"Agent/UDP/PDP create _o30 "

[Code].....

View 8 Replies View Related

Ubuntu :: Compilation Tcl Error / Link With Tcl?

Jun 17, 2010

I am compiling a package which use Tcl and got results as follow:

/usr/bin/ld: cannont find -ltcl8.4
collect2: ld returned 1 exit status

how to link with tcl? which file to link? it is a file like libtcl.a ?

View 1 Replies View Related

Ubuntu :: Compiling Driver For First Time Error Installing?

Nov 5, 2010

10.10) now, and only use windows as my DVR (what im currently trying to change). To that end, i have a Hauppauge 2250 video capture card, and Steven at KernalLabs has an alpha release that has been said to work very well with mythTV.

Anyways, i followed one of the posts and successfully compiled the driver using "sudo make menuconfig." I attempted to install with the "make install" command, and the first half of the driver seemed to install and the second half (firmware related) received errors.

make -C firmware install
make[2]: Entering directory `/home/mlavigne/saa7164-v4l/v4l/firmware
Installing firmwares at /lib/firmware: vicam/firmware.fw cp: cannot stat `vicam/firmware.fw: No such file or directory
dabusb/firmware.fw cp: cannot stat `dabusb/firmware.fw: No such file or directory
dabusb/bitstream.bin cp: cannot stat `dabusb/bitstream.bin: No such file or directory
ttusb-budget/dspbootcode.bin cp: cannot stat `ttusb-budget/dspbootcode.bin: No such file or directory

[Code]..

View 3 Replies View Related

Ubuntu :: Error While Compiling Fortran Program With Gfortran

Apr 14, 2011

I've a FORTRAN program that I would like to compile in my machine. I've gfortran installed, so I issue the command: gfortran asc2bin.f write_geogrid.o

but this error are displayed

Code:
asc2bin.f:3.72:
INTEGER isigned,i,j,endian,wordsize,nx,ny,xllcorner,yllcorner,
1
Error: Invalid character in name at (1)

[Code].....

View 1 Replies View Related

Ubuntu Installation :: Sdl-config Error When Compiling DOSbox 0.70?

May 8, 2011

Trying to compile DOSbox version 0.70. Apparently this is the only version that can run Privateer flawlessly.Problem is, when I extract the source and try to './configure', I get an error that SDL 1.2 is not installed.

Code:
anthony@anthony-1010:~/Games/DOS/dosbox-0.70$ ./configure
checking build system type... i686-pc-linux-gnu

[code]....

View 1 Replies View Related

Red Hat / Fedora :: Error While Compiling Samba ?

Jun 30, 2011

Im trying to install the latest stable release of Samble but I am recieving errors during the make process.

Also is there and ezier way to install samba than compiling from source?

Forgot to mention i cannot use yum because this computer cannot be connected to the internet.

View 5 Replies View Related

General :: Error In Compiling - 2.6.30.i586

May 27, 2010

I am using Fedora 11 (2.6.30.10-105.2.23.fc11.i686.PAE). I got a patch for tpm_tis.c which a module to get my itpm working. And, for this I thought to customise the existing kernel and install new one.

So, I followed the foolowing steps:

In 'make menuconfig' , I have disabled Kernel debugging in the Kernel hacking section.

Then changed EXTRAVERSION to something like .test in Makefile

And, My Idea is to follow these steps:

View 1 Replies View Related

General :: Compiling Kernel 2.6.32.2 Error

Jan 4, 2010

I'm currently using Fedora 12 with kernel 2.6.31.9 and I was trying to upgrade to 2.6.32.2. These are the steps I followed. After rebooting and choosing this kernel from the Grub menu, I'm just greeted with a black screen with a blinking cursor and it won't proceed beyond that.

These are the commands I issued. I received an error on the first make modules about the mismatch. I then ran CONFIG_DEBUG_SECTION_MISMATCH=y and once finished I ran make modules again and it completed successfully.

Code:
Downloaded kernel package 2.6.32.2 from www.kernel.org
untar archive
make menuconfig (no changes made, saved config file)
make

[Code]...

View 9 Replies View Related

General :: Compiling Using Cygwin - Error Not ELF

Oct 14, 2010

New to this kernel stuff But not too new to C/C++. I'm trying to compile the linux kernel on a PC, that is running Windows XP 32 bit, using Cygwin. I keep getting the error saying:

Error: Not ELF
make[2]:*** [scripts/mod/elfconfig.h] Error 1
make[1]:*** [scripts/mod] Error 2
make:***[scripts] Error 2

Every time I try to compile it from the main directory of the source, which I hope is what I'm supposed to do, I always get this.

View 14 Replies View Related

Software - Error On Compiling E2fsprogs 1.41.12 For Arm

Dec 14, 2010

I have tried to compiled e2fsprogs-1.41.12 to be used on my android device that runs linux kernel. I need to compile it with -static option but building returns error First is the configure:

[Code]...

View 1 Replies View Related

Software :: GDB Compiling Error For ARM Processor

Jan 4, 2010

When I compiling gdb for ARM processor I am getting this error as:

Code:
checking for iconv declaration... install-shextern size_t iconv (iconv_t cd, char * *inbuf, size_t *inbytesleft, char * *outbuf, size_t *outbytesleft);
checking for library containing waddstr... no
configure: WARNING: no enhanced curses library found; disabling TUI
checking for library containing tgetent... no
configure: error: no termcap library found
make[1]: *** [configure-gdb] Error 1
make[1]: Leaving directory `/mnt/freescale/sources/gdb-7.0'
make: *** [all] Error 2
sharief@sharief-desktop:/mnt/freescale/sources/gdb-7.0$

What will be the error. I think the termcap library is not there. I downloaded and cross compiled tremcap library but still it is not working.

View 1 Replies View Related

Slackware :: Error Compiling Apache Fop- 1.0 On 64 13.1

Mar 26, 2011

I em trying to compile fop-1.0 on Slackware64 13.1. I have ant 1.8.1 Slackware package.

Here is the output of ant build:

Code:

View 2 Replies View Related

Slackware :: Error Compiling Squidguard-1.4

Mar 27, 2011

I'm trying to install squidGuard-1.4, I have a minimal install. I have installed squid-3.2.0.5 without any problems, but squidGuard is driving me crazy

I can run the ./configure with no problems but when I run make, or make install I keep getting this error:

Code:
make: *** [y.tab.c] Error 141
And that is is all, no more verbosity or anything else.
Error suggests that YACC is missing but bison is present, also db4 (tried with db44 and db3, same story).

Just in case you can see anything I cannot I've attached the config.log

View 2 Replies View Related

Ubuntu Installation :: Obtuse Error Message Compiling Freeradius

Aug 6, 2010

This is for freeradius-1.1.7. I'm trying to compile freeradius to get around the missing rlm_eap_tls.so library, following/adapting the instructions in this thread.

Now I'm stuck at an error that says:

/bin/bash: line 20: --with-rlm_sql_postgresql_lib_dir=/usr/lib/freeradius: No such file or directory
/bin/bash: line 20: --with-rlm_sql_postgresql_include_dir=/usr/include/postgresql: No such file or directory

The directories named DO exist. The line numbers make no sense. A script error, perhaps? Or, a badly worded error message that actually means something else?

View 4 Replies View Related

OpenSUSE :: Error While Compiling / Installing Software

Jun 25, 2010

I am trying to install a software but I get error as under -

[Code]...

View 9 Replies View Related

Software :: Compiling Error Message Can't Figure Out?

May 31, 2009

Usually when a compile doesn't work, the error message indicates a missing dependancy, and it's pretty straightforward. This came up while trying to install arts-1.5.10 for KDE 3.5

Code:
mcoputils.cc:74: error: 'PATH_MAX' was not declared in this scope
mcoputils.cc:91: error: 'kde_tmp_dir' was not declared in this scope

[code]....

View 3 Replies View Related

General :: Compiling Error: /usr/bin/ld: Cannot Find -lexpat1

May 11, 2011

I've been around the block with this problem and don't know what else to check to compile source for gpsbabel-1.4.2. Other posts on this forum mentioning the same error with no resolution on this specifically. I have looked at the following:

1. The Makefile looks like this for the part compiling with expat options:

Code:

gpsbabel$(EXEEXT): configure Makefile $(OBJS)
$(CC) $(CFLAGS) $(LDFLAGS) $(OBJS) -lm -L/lib -lexpat -L/usr/lib -lusb $(OUTPUT_SWITCH)$@

2.Search for library files:

Code:

$find /usr/lib -type f -name "*expat*" -print
/lib/libexpat.so.1.5.2
/lib/libexpatw.so.1.5.2

[code]....

View 1 Replies View Related

General :: Error During Kernel Module Compiling

Mar 13, 2011

I update my last kernl to 2.6.38-rc7 but when I launch VirtualBox, on stdout.The vboxdrv kernel module is not loaded. Either there is no module available for the current kernel (2.6.38-rc7) or it failed to load. Please recompile the kernel module and install it by sudo /etc/init.d/vboxdrv setup.

View 1 Replies View Related







Copyrights 2005-15 www.BigResource.com, All rights reserved