Ubuntu :: General Error Mounting Filesystems - Error "No Such File Or Directory Fsck From Util-linux-ng 2.16"

Apr 1, 2010

My ubuntu stops when mounting system hdd. The screen display the following messages :

mountall:/etc/fstab: No such file or directory fsck from util-linux-ng 2.16 WARNING: couldn't open /etc/fstab: No such file or directory init: mountall main process (545) terminated with status 1 General error mounting filesystems. A maintenance shell will now be started. CONTROL-D will terminate this shell and re-try. udevd[560]: can not read '/etc/udev/rules.d/z80_user.rules. Ubuntu: clean, 474879/24231936 files/28016581/96898047 blocks root@i7:~# exit_

I suspect the disk manager pysdm that i had just installed today and it had crash during the previous session. The /etc/fstab file does not exist anymore and i cant rename the fstab.bak because the disk is read-only even for my root user

View 1 Replies


Ubuntu :: Get The 'General Error Mounting Filesystems?

Aug 29, 2010

When I try to start up 9.10 I can get past GRUB but not fsck. A file check will be started but no progress will be made and finally I get the 'General error mounting filesystems'.Trying in recovery mode I get this just before the fsck check

fsck from util-linux-ng 2.16
[8.016378] ACPI: I/O resource piix4_smbs [0xb00-0xb07] conflicts with ACPI region SOR 1 [0x0b00-0xb0f]
/dev/sda1 goes fine
/dev/sda3 has been mounted 34 times without being checked, check forced
mountall: canceled


This seems to be slightly different than the other threads I've seen discussing this issue. It just all of a sudden happened, I didn't upgrade anything or have any crashes immediately prior.

View 2 Replies View Related

Ubuntu Installation :: General Error Mounting Filesystems After Interrupted Upgrade From 10.04 To 10.10

Oct 13, 2010

Originally posted in Launchpad yesterday [Question #129083]:

Quote: System froze in mid-upgrade from 10.04 to 10.10 and now fails to boot, giving a 'general error mounting filesystems' message when loading [in either normal or recovery mode.] However, the boot menu remains accessible with the F8 key and is functional.

While in the 10.10 Live CD, using the chroot method in the grub2 help proved unsuccessful and returned this pastebinned result. The system is 10.04 64-bit running an nvidia card and sporadically froze with increasing frequency. No resolution to the freezing could be found online, which seemed associated with any of nvidia, usb, flash or even firefox. Can someone suggest an alternative to restore to bootable condition and resume upgrade without having to reinstall and wipe the drive? I also followed the copy alternative to the chroot method in the grub2 help and still get the same core dump for chroot and device not found error for upgrade-grub as posted in pastebin. I'm still running off of the 64-bit 10.10 Live CD.

Skimming other "general error mounting filesystems" topics in this section, I realise I may have to bite the bullet and cut my losses, since those other users seemed to settle for a reinstall. Any final advice out there I can try out?

View 2 Replies View Related

Fedora :: Error - Fsck.ext3: No Such File Or Directory Durante L'apertura Di /dev/cciss/c0d1p11

Oct 21, 2009

I have a problem partitioning an Hard Disk Drive on a server, and I hope someone can help me with this. Here is the system configuration: Operating System Linux localhost.localdomain #1 SMP Fri Sep 25 04:43:32 EDT 2009 x86_64 x86_64 x86_64 GNU/Linux

Hardware: RAID bus controller: Hewlett-Packard Company Smart Array G6 controllers (rev 01)

The system mounts one hard disk (120 Gb) with the OS, and four 1.5Tb Hard Disks mounted on RAID 10 for a total of ~3 Tb I need to create several partitions on this RAID drive, but I have some trouble doing it. I need a total of 10 partitions of different sizes:


View 3 Replies View Related

Ubuntu :: 10.04 "general Error Mounting Filesystems"

Jan 18, 2011

I'm getting this error on boot of Mint 9 64bit. It gets to the grub boot screen (dual boot - Mint 9 32 & 64 bit) and I can boot into the 32 bit version, but the 64 bit results in that error. If I go into the maintenance shell & try fdisk -l, I get: fdisk: error while loading shared libraries: libuuid.so.1: cannot open shared object file: no such file or directory

View 4 Replies View Related

Ubuntu :: Error - Mounting /dev On /root/dev Failed: No Such File Or Directory

Apr 4, 2010

I have recently experienced a problem that occurred after an automatic update. After the update it said restart system. So I did and proceeded as normal. when after the reboot Firefox suddenly stopped working, crashed and upon clicking it again only a blank box appeared. Then my other apps followed and i soon couldn't do anything so i shut down my computer. Upon restart I got a black screen with tons of text and something around the lines of

mount: mounting /dev on /root/dev failed: No such file or directory
mount: mounting / sys/ on root/sys failed: No such file or directory
mount: mounting /proc on /root/proc failed: No such file or dirctory


So I rebooted and pressed shift to open that grub thing and booted from an earlier kernel. This time it said checking HD for errors and after booted normally. Everything seemed fine but next day it did it again. Starting with Firefox crashing and then everything else. I again booted from a previous kernel and it worked but upon checking with uname -a it did not list the kernel i chose to boot from. So I decided to upgrade 10.04 to 10.10. This upgraded my kernel and deleted the old ones so i am hoping i am good now.

View 2 Replies View Related

Ubuntu :: Initramfs Boot Error - Mount: Mounting /dev /root/sys Failed: No Such File Or Directory

Feb 19, 2011

Okay, so on occasion when I boot into ubuntu I get this error

[mount: mounting /dev /root/dev failed: no such file or directory]
[mount: mounting /dev /root/sys failed: no such file or directory]
[mount: mounting /dev /root/proc failed: no such file or directory]


I get the error when I open any of the kernel versions or any recovery mode. Ubuntu 10.10 Desktop is the only OS installed on the computer, which is a Lenovo S10-3. I can eventually get it to go away, sometimes by repeatedly unplugging it and plugging it back in, and sometimes I will boot into GParted, do nothing, then restart and it will work.I have found some solutions online, but all of them involve the error happening as a result of dual booting with Windows.I have made no major system changes recently, so I can't see anything like that being the problem.

View 3 Replies View Related

CentOS 5 :: Error Mounting Device UUID=cee298a0-9c47-4a3a-ac84-23db4d20edd5 As /. No Such File Or Directory

Dec 22, 2009

CentOS 5.3 has been running fairly good except for a slow ethernet connection so I thought I would upgrade to CentOS 5.4 to see if that improved things. I had previously changed fstab and menu.lst to use UUID instead of LABEL in order to insulate myself from partition label changes I wanted to make. This worked fine in CentOS 5.3. When I attempted to upgrade from 5.3 to 5.4 using the installation disk and telling it to upgrade rather than do a new install, the installation correctly found my root partition as /dev/sdb8. When I proceeded with the upgrade I received the error:

"Error mounting device UUID=cee298a0-9c47-4a3a-ac84-23db4d20edd5 as /. No such file or directory. This most likely means the partition has not been formatted."

But of course it has been formatted and is my / partition running CentOS 5.3 as I type. how to fix this to get CentOS 5.3 upgraded ? Di I have to use LABEL in fstab and menu.lst for my partitions,or perhaps just for my root partition ? Any other ideas why this is failing ?

View 1 Replies View Related

Ubuntu :: Install A Copy Of Postgres Using The .bin - Error "bash: ./postgresql-9.0.4-1-linux.bin: No Such File Or Directory"

May 26, 2011

I'm trying to install a copy of Postgres using the .bin(I want pg Admin III as well which is why I'm not using apt-get). It's sitting in downloads so I did the following:

$ cd /home/ryan/Downloads
$ sudo chmod +x postgresql-9.0.4-1-linux.bin
$ ./postgresql-9.0.4-1-linux.bin

but I keep getting: -bash: ./postgresql-9.0.4-1-linux.bin: No such file or directory I did -ls and the file is there and I can't figure out how to get this installed.

View 9 Replies View Related

Ubuntu :: Error On Startup - Error Where Found When Mounting The Disk File

Apr 20, 2011

I was installing last night some applications , then i forgot to plugin my laptop so suddenly it turned off , anyways today i turned it on , while booting it gave me this error : "error where found when mounting the disk file /"so i press I to ignore , and it works , but now how can i fix this error?

View 1 Replies View Related

General :: Fsck And Manually Mounted Filesystems?

Nov 12, 2010

I want the filesystem of my external drive to be checked periodically after a numer of mounts. I put 2 in the sixth colums of fstab for this partition

and I use the tune2fs to set the maximum mount count to 32.
tune2fs -c 32 /dev/sdb

now the mount count is 34 and the date of the last check is not recent, so apparently the auto fsck has not been performed. Probably because this partition is not mounted at start-up but I usually mount it manually.

View 3 Replies View Related

Ubuntu :: General Error Mounting File System

Apr 13, 2011

I have a dual boot Xp and Ubuntu 10.10.

Recently I was downloading some upgrades in Ubuntu and unfortunately the power to the system got off.

Thereafter on booting it comes to the Grub menu and I'm able to select the OS from the list but if I choose Ubuntu it comes up with a message "General error mounting file system" and the terminal is activated. However, if XP is selected it boots with no issues.

/dev/sda6 is ubuntu installation
/dev/sda7 is swap partition

I went through lot of threads over the net and tried fsck, e2fsck and other variations of that command but at the end all I get the message as

it says sda6 is clean but for sda7 it says :

Superblock invalid trying backup blocks.... Bad magic number in super-block while trying to open /dev/sda7 at the end it suggests "u might try running e2fsck with an alternate superblock: e2fsck -b 8193 <device>"

refering some threads here I tried my luck with live CD and the command : sudo e2fsck -C0 -p -f -v /dev/sda7

View 9 Replies View Related

Ubuntu :: E: Could Not Perform Immediate Configuration On 'util-linux'

May 15, 2010

I ran into this problem myself, and I've seen that others have had the same problem when updating from Karmic to Lucid via apt-get. There is a bug in apt for Lucid, and it has been noted on one of the Ubuntu lists

This is a simple how-to and a work-around to the upgrading with apt-get:

1) Update your sources.list file to replace all instances of 'karmic" to 'lucid' : $ sudo sed -i 's/karmic/lucid/g' /etc/apt/sources.list

2) Run apt-get update: $ sudo apt-get update

3) Run a regular upgrade; $ sudo apt-get upgrade -y

Here is where the problem comes in. Apt is looking for the util-linux package, which is part of upstart-job, but someone apparenlty forgot to write the code to tell apt-about this (whoops!)

So, you now need to install upstart-job by itself. By skipping this step you will get the error message when you try to run step 5: "E: Could not perform immediate configuration on 'util-linux'.Please see man 5 apt"

4) $ sudo apt-get install upstart-job

5) Now you can run apt-get dist-upgrade: $ sudo apt-get dist-upgrade -y

View 6 Replies View Related

General :: Post Update: Fsck.ext3 : No Such File Or Directory While Trying To Open /dev/dm-2

Mar 18, 2010

After a massive update including grub (not the problem) I cannot mount and boot because of the dubject error message. /root (dm-0) and swap (dm-1) are ok its just /home (dm-2) that appears broken.

View 1 Replies View Related

General :: 6.13 GMP-5.0.0 LFS Make Error - Cannot Open Shared Object File: No Such File Or Directory

Jun 10, 2010

I'm currently stuck at 6.13 GMP-5.0.0 of the LFS installation. After running make, I receive the following:

error while loading shared libraries: libbfd-2.20.so: cannot open shared object file: No such file or directory
make[2]: *** [libmpn.la] Error 127
make[2]: Leaving directory `/sources/gmp-5.0.0/mpn'


View 5 Replies View Related

General :: Error - Su: No Such File Or Directory

Jul 21, 2011

If I type su, it gives me following error su: No such file or directory

View 5 Replies View Related

General :: No Such File Or Directory - Error

Jun 30, 2010

I copied g95 executable under /usr/bin which is clearly in my PATH. When I type g95, it says "bash: /home/username/bin/g95: No such file or directory". Why doesn't it look for somewhere else that is in my PATH?

View 5 Replies View Related

Slackware :: Skype Not Working With Latest Util-linux?

May 19, 2010

I've found that my skype stopped working with recent -current updates ( around beta ... ). It was looking for a libuuid.so.1 library - on checking I found the 64-bit version but no 32-bit version - quite strange as this has been working fine since my original slackware64 13.0 installation. Anyhow, I got the 32-bit util-linux package, did the 32-bit package convert thing and skype is now working:

1. convertpkg-compat32 -i util-linux-ng-2.17.2-i486-1.txz
2. un-archive
3. copy the libuuid lib to /lib and soft-link in /usr/lib

I didn't install the whole compat package as this is not really necessary I think.

View 1 Replies View Related

General :: Error :ppc_4xx-g++: .exe: No Such File Or Directory?

Jul 15, 2011

i have this make file in order to generate hello.exe.compiled with visuel c++.

#include <iostream>
using namespace std;


View 4 Replies View Related

General :: Error: X11/Xlib.h: No Such File Or Directory

Aug 1, 2011

I am trying to compile the code. I am getting this following error. Am I missing any package?

x86_screen.h:12:22: error: X11/Xlib.h: No such file or directory
In file included from osal_event.c:12:
x86_screen.h:25: error: expected specifier-qualifier-list before �Display�
make[1]: *** [osal_event.o] Error 1

View 5 Replies View Related

General :: Getting Error Message - No Such File Or Directory

Sep 30, 2010

I am migrating an application from HP-UX to Redhat Linux and I have some files of scripts. In one of the script files I have the line /pylive/smartPAY/spserver/scripts/sp.con which is the correct path and file name for an existing file. However I get the message "No such File or Directory/pylive/smartPAY/spserver/scripts/sp.con" The script worked fine in HP-UX, why not in Redhat Linux?

View 6 Replies View Related

General :: Fsck Error During Start Up?

May 25, 2010

I get an error during start-up

fsck failed. Please repair manually

If I Ctrl D to carry on everything boots up ok as far as I can tell.

If I try and fix:
# fsck /dev/hdb1
fsck 1.37
e2fsck 1.37
/dev/hdb1: clean, 38/7340032 files, 283481/1465320 blocks


View 14 Replies View Related

General :: Cmem.c:38:19: Error: Stdio.h: No Such File Or Directory

Aug 10, 2010

I am trying to compile a memory map module cmem.ko from TI codec tools. This is for the DSPlink software development for the OMAP3530. I am compiling this on the host(Ubuntu). First error could not find cc1 and i re-installed gcc and added it to the path. That fixed that error but then I get to this:

cmem.c:38:19: error: stdio.h: No such file or directory
cmem.c:39:20: error: unistd.h: No such file or directory
cmem.c:40:22: error: sys/mman.h: No such file or directory


View 1 Replies View Related

General :: Elementary Script Error 'No Such File Or Directory'

Sep 18, 2010

When testing my script for a question, I find that when I execute the expanded commands, I get no error message, but when I source the file with the command, I get 'No such file or directory'. Here is what I mean:


View 7 Replies View Related

General :: Process_30sec.c:15:23: Error: Asm/bitops.h: No Such File Or Directory

Oct 4, 2010

I am trying to compile a file named process_30sec.c(thats a C program) through the Ubuntu terminal and it is showing the following error in command terminal: process_30sec.c:15:23: error: asm/bitops.h: No such file or directory I have just started using Ubuntu&Linux so I am not familiar with lots of commands and things going around.I am using the following command to compile the process_30sec.c file:

kutub@ubuntu:~/Desktop$ gcc process_30sec.c

The above mentioned program file contains a header file <asm/bitops.h>, that I need to use in the program.It seems that this header file is not recognized by the system, and it needs to be included somewhere in the system so that the terminal would allow me to compile this program.

View 3 Replies View Related

General :: Rt3070sta.ko No Such File Or Directory On Slackware - Error

Sep 11, 2010

I'm trying to install a WiFi Wireless IEEE 802.11N/G/B WLAN 150Mbps Network Adapter USB2.0 on Slackware. I get the following message when I enter "make install." cannot stat rt3070sta.ko no such file or directory

View 9 Replies View Related

General :: Can't Compile Gcc - Fatal Error: Stdio.h: No Such File Or Directory

Feb 19, 2011

I am trying to upgrade my NAS with anew toolchain, gcc-4.5.2. The NAS have been "hacked" fonz_plug, that contain a gcc version 4.1.3 with uClibc. I have download all needed tar files and done the following.My goal is to upgrade the gcc to 4.5.2 and replace the ucLibc on the system with a GNU libc.

# Pass one
# binutils
./configure --prefix=/ffp --libdir=/ffp/lib --includedir=/ffp/include --with-gmp=/ffp --with-mpfr=/ffp
But when I try to compile the gcc with
../configure --prefix=/ffp --libdir=/ffp/lib --includedir=/ffp/include --enable-__cxa_atexit --with-float=soft --enable-languages=c,c++ --with-build-sysroot=/ffp --with-build-time-tools=/ffp/bin --with-system-zlib --enable-threads=posix --disable-bootstrap


View 6 Replies View Related

General :: ERROR: Iostream.h: No Such File Or Directory / Cin Was Not Declared In This Scope?

Jun 8, 2010

I create a simple code for add two number:

int num1, num2, sum;

I search the answer to my problem in various forums but I can't solve the problem.I think that is due to I need some package or that I don't install the necessary libraries.

View 2 Replies View Related

General :: How To Determine Exact Directory / File From Error Message

Mar 11, 2011

Is there any way to tell which file or directory this is referencing in particular?

View 8 Replies View Related

General :: Lyx: File Name Error The Directory Path To The Document Cannot Contain Spaces

Sep 9, 2009

trying to write my thesis in Lyx 1.6. It works fine on my windows laptop at home but Not on my work computer. The problem is, when i try to view it in pdflatex it comes with with: Lyx: file name error The directory path to the document cannot contain spaces

View 1 Replies View Related

Copyrights 2005-15 www.BigResource.com, All rights reserved