Software :: Exaile ( Error - Object Register Function Deprecated

Aug 18, 2010

I have been trying to install this nice looking piece of software for the last 3/4 days, my lastest error is..

** Message: pygobject_register_sinkfunc is deprecated (GtkWindow)
** Message: pygobject_register_sinkfunc is deprecated (GtkInvisible)
** Message: pygobject_register_sinkfunc is deprecated (GtkObject)
INFO : Loading Exaile
INFO : Loading settings...
** Message: pygobject_register_sinkfunc is deprecated (GstObject)
Traceback (most recent call last): .....

I have installed:

View 8 Replies


Slackware :: Exaile Failing To Start - Object Has No Attribute

Feb 26, 2011

I wrestling with a new slackware install and I've got a problem with exaile. It was built with sbopkg, and doesn't work. It doesn't start at all from the menu (in Xfce,) and provides the following error message when started from Terminal:

INFO : Loading Exaile
INFO : Loading settings...
Traceback (most recent call last):
File "/usr/lib64/exaile/", line 52, in <module> main()
File "/usr/lib64/exaile/", line 49, in main exaile = main.Exaile()
File "/usr/lib64/exaile/xl/", line 96, in __init__self.__init()
File "/usr/lib64/exaile/xl/", line 132, in __init self.__show_splash()
File "/usr/lib64/exaile/xl/", line 260, in __show_splash import xlgui
File "/usr/lib64/exaile/xlgui/", line 53, in <module> from xlgui import devices, guiutil, icons, preferences, queue
File "/usr/lib64/exaile/xlgui/", line 34, in <module> from xlgui import collection
File "/usr/lib64/exaile/xlgui/", line 36, in <module> from xlgui.widgets import dialogs
File "/usr/lib64/exaile/xlgui/widgets/", line 452, in <module> class MessageBar(gtk.InfoBar):
AttributeError: 'module' object has no attribute 'InfoBar'

View 3 Replies View Related

Ubuntu Multimedia :: Error - Object Reference Not Sent To An Instance Of An Object

Mar 6, 2010

I've been using the PPA version of banshee, and I got this error - just wondering if anyone else has it too! I'm able to play a song, but when the song finishes and the next one starts I get this error: Banshee Encountered a Fatal Error Object reference not sent to an instance of an object Error details:

An unhandled exception was thrown: Object reference not set to an instance of an object
at Hyena.Gui.Theming.GtkTheme.GetCairoTextMidColor (Gtk.Widget) <0x00017>
at Banshee.NotificationArea.NotificationAreaService.get_TextLightColor () <0x0002f>
at Banshee.NotificationArea.NotificationAreaService.MarkupFormat (string,string[]) <0x00043>
at Banshee.NotificationArea.NotificationAreaService.GetByFrom (string,string,string,string) <0x000d7>


View 4 Replies View Related

Programming :: Execute A Function Which Is In A Object File Throgh Libbfd?

Sep 10, 2010

I hava a source file add.c

int add(int a,int b){
return a+b;

then i compile it, gcc -c add.c now we get a object file add.o, I want to execute the function add(int a,int b)(the functinon in the object file add.o) how can i use libbfd to execute it?

View 1 Replies View Related

Slackware :: Error Message When Tried To Run Clive - Md5 Module Deprecated

Mar 5, 2011

Having not used Clive in over a year I went over to [URL]... and downloaded, built, and installed both Clive and URLgrabber. Here is error message when I tried to run Clive,


View 10 Replies View Related

Networking :: Error: Code: Using Intrapositioned Negation Deprecated In Favor Of Extrapositioned

Nov 25, 2009

I'm using them to make a simple firewall on the girlfriends computer that is directly connected to the Internet. I wish to block everything except for a SSH port for me to admin with, and normal use things like a web browser. I grabbed an old template for the config and modified as needed. I'm getting an error that I'm not sure what is causing it. it is saying all incoming packets on any device is accepted. Or since there are explicit rules for eth0, that lines just means for any other device, which in her case there are none, so ends up meaning nothing?


View 2 Replies View Related

General :: Conky's Config / Error Border_margin Is Deprecated, Please Use Window.border_inner_margin Instead?

Jan 6, 2010

I'm using Conky in my Ubuntu 9.10 Karmic. I have an error message like this:


Conky: border_margin is deprecated, please use window.border_inner_margin instead
Conky: one or more $endif's are missing
Conky: desktop window (1a00065) is subwindow of root window (10d)
Conky: window type - override

View 3 Replies View Related

Software :: Exaile Suddenly Not Working - Attribute Error

Apr 6, 2011

I am in Ubuntu 10.04 with its standard desktop environment. Exaile was working great. Now, suddenly it refuses to work. It brings up the splash/loading image and then dies. It works fine under a different user account. I completely restarted, completely uninstalled, completely reinstalled through the Ubuntu Software Center. No luck. I then tried to run it via a terminal.

Here was the output:
wmeler@ubuntu1004:~$ exaile
INFO : Loading Exaile
INFO : Loading settings...
INFO : Setting up deferred idle manager function...
INFO : Loading plugins...
INFO : Loading collection...
INFO : Loading devices...
Traceback (most recent call last):
File "/usr/lib/exaile/", line 52, in <module> main()
File "/usr/lib/exaile/", line 49, in main exaile = main.Exaile()
File "/usr/lib/exaile/xl/", line 84, in __init__self.__init()
File "/usr/lib/exaile/xl/", line 189, in __init
location=os.path.join(xdg.get_data_dirs()[0], "covers"))
File "/usr/lib/exaile/xl/", line 121, in __init__self.load()
File "/usr/lib/exaile/xl/", line 330, in load data = pickle.load(f)
EOFError Exception in thread Thread-4:Traceback (most recent call last):
File "/usr/lib/python2.6/", line 532, in __bootstrap_inner
File "/usr/lib/python2.6/", line 484, in run self.__target(*self.__args, **self.__kwargs)
File "/usr/lib/exaile/xl/", line 66, in connect logger.warning("Failed to connect to HAL,"
AttributeError: 'NoneType' object has no attribute 'warning'

View 2 Replies View Related

Programming :: Error: Unknown Register Name '%eax' In 'asm'?

Mar 15, 2011

An error occur when I compile my inline assemble code with a alpha/linux cross compiler.code:

#define CPU_ID(cpu_iid)
__asm__ __volatile__ (


View 2 Replies View Related

Ubuntu Multimedia :: Exaile Player - Error Connecting Shoutcast Server

Dec 29, 2010

I have been using Ubuntu for almost one year or so. I use to have a good experience with it. But, since last few days I have been experiencing something nuance with my Ubuntu and most particularly the Exaile player. It use to connect to the Shoutcast server fine. But, these days I can't connect it. Everytime I try to connect it; it shows the message, "Error connecting shoutcast server". I have tried reinstalling it along with the normal plugins that use to work fine. But nothing seems working.

View 7 Replies View Related

OpenSUSE :: RPC Authentication Error - Cannot Register Service

Feb 8, 2010

I am trying to solve problem with software which needs to have access to network card I suppose. Installation run without any problems but when I am launch software I get such message as normal user:
Cannot register service:
RPC: Authentication error; why = Client credential too weak.

When I launch program as root I get this:
WARNING: localhost appears to have the loopback address as IP address
This may imply that processes on arlin may not be able to connect to non-local processes but program starting with success at least. What I should do to run program as normal user?

View 5 Replies View Related

SUSE / Novell :: Cannot Register Service - RPC - Authentication Error - Why Client Credential Too Weak

Feb 8, 2010

I have a program to start called "pace_old".

In the command line I type it's name and get this:

What should I do ?

Distro is SuSe 11.1. Btw: I do not get this message on Suse 9.0. Pace_old runs properly there.

View 1 Replies View Related

Ubuntu :: Error While Hash Checking Of Torrent - The Sha Module Is Deprecated - Use The Hashlib Module Instead From Sha Import Sha

Jun 8, 2010


nits@nits-desktop:/mnt/Storage/Tors/Incomp$ btdownloadcurses --check_hashes 1 filename.torrent
/usr/lib/python2.6/dist-packages/BitTorrent/ DeprecationWarning: the sha module is deprecated; use the hashlib module instead from sha import sha

These errors occurred during execution:

[09:37:48] IOError - [Errno 5] Input/output error

Got this error when I tried hash checking, was downloading the file using rtorrent when there was a sudden powercut and my system shutdown abruptly, tried restarting the torrent and kept encountering problems while restarting.

View 2 Replies View Related

Fedora :: YUM Update Error - Object Has No Attribute

Oct 23, 2009

My os is fedora 11. The error message is :

Traceback (most recent call last):
File "/usr/share/PackageKit/helpers/yum/", line 1830, in _runYumTransaction rpmDisplay=rpmDisplay)
File "/usr/lib/python2.6/site-packages/yum/", line 3813, in processTransaction
pkgs = self._downloadPackages(callback)
File "/usr/lib/python2.6/site-packages/yum/", line 3837, in _downloadPackages
probs = self.downloadPkgs(dlpkgs)
File "/usr/lib/python2.6/site-packages/yum/", line 1372, in downloadPkgs'predownload', pkglist=pkglist)
File "/usr/lib/python2.6/site-packages/yum/", line 177, in run
func(conduitcls(self, self.base, conf, **kwargs))
File "/usr/lib/yum-plugins/", line 577, in predownload_hook
(problems, more) = downloadPkgs(conduit, pinfo, download_pkgs)
File "/usr/lib/yum-plugins/", line 419, in downloadPkgs
cb.start(text="<delta rebuild>", size=rebuild_size)
File "/usr/lib/python2.6/site-packages/urlgrabber/", line 129, in start self._do_start(now)
File "/usr/share/PackageKit/helpers/yum/", line 2551, in _do_start
self.updateProgress(name, 0.0, "", "")
File "/usr/share/PackageKit/helpers/yum/", line 2593, in updateProgress
pkg = self._getPackage(name)
File "/usr/share/PackageKit/helpers/yum/", line 2534, in _getPackage
sections = name.rsplit('-', 2)
AttributeError: 'NoneType' object has no attribute 'rsplit'

View 5 Replies View Related

Programming :: Object To Represent An Object Of Different Types?

Mar 1, 2010

Only ones I can think of seem overly complex, and I'm sure there is a simple solution I am overlooking. I have a class, it has a member who is an object. This object needs to be able to represent an object of different types.


Where "surface" could be several different types, which will be set during execution. Hope this is clear enough. I have tried using templates but am getting "data member cannot be a member template". Either I have incorrect syntax, or am not implementing it right. another solution would have one class containing definitions of all possible shapes, But this would take up extra memory. Other solutions I thought of seem too round-about, and seems there is a simpler solution that I have overlooked.

View 8 Replies View Related

Fedora Installation :: Login / Boot Error "Register 0x00004030 Not Found In PLL"?

Jul 16, 2011

I installed fedora 15 last night, everything installed ok, but i noticed that when i shut down and before i log on, even just running from the cd, a brief message saying something along the lines of "Register 0x00004030 not found in PLL" comes up.

Is this normal? ive installed ok and every update so far has worked so i dont think its a corrupt install. Ive gone back to ubuntu for the time being but I wish to go back to fedora, though I just want to know what this error is

View 3 Replies View Related

Fedora :: Error: Object '' From LD_PRELOAD Cannot Be Preloaded: Ignored

Jun 26, 2010

I cannot run Opera. I am running a fresh install of Fedora 13 (everything updated). When I try to run Opera, it fails with this error message:


[ore@spectrum ~]$ opera
ERROR: object '' from LD_PRELOAD cannot be preloaded: ignored.
ERROR: object '' from LD_PRELOAD cannot be preloaded: ignored.
/usr/lib/opera/opera: error while loading shared libraries: cannot open shared object file: No such file or directory
[ore@spectrum ~]$

View 6 Replies View Related

Ubuntu :: Nautilus Actions Error - Duplicate Object ID

Jan 8, 2010

I installed Nautilus-actions, in order to set up some right-click scripts. However, when I click on "nautilus actions configurations" from within the system preferences menu, I receive the following error...
"Duplicate object id 'label1' on line 1000 (previously on line 940)".

View 1 Replies View Related

Software :: Error: Could Not Read Object Configuration Data

Jul 20, 2010

I have installed it and setup an apache conf. Nagios http page loads but shows errors on every sub-page.

Error: Could not read object configuration data!Here are some things you should check in order to resolve this error:

1. Verify configuration options using the -v command-line option to check for errors.
2. Check the Nagios log file for messages relating to startup or status data errors.

Make sure you read the documentation on installing, configuring and running Nagios thoroughly before continuing. If all else fails, try sending a message to one of the mailing lists. More information can be found at [URL]..Looking for some assistance, or better still PM me if you'd be willing to remote on and have a look for me.

View 14 Replies View Related

Programming :: Error With Compiling Program 'can Not Be Used When Making Shared Object'

Oct 14, 2010

I've got an error with compiling a program: relocation R_X86_64_32 against `a local symbol' can not be used when making a shared object; recompile with -fPIC /usr/lib/python2.5/config/libpython2.5.a: could not read symbols: Bad value collect2: ld a retourn 1 code dtat d'excution make[2]: *** [bindings/] Erreur 1.

View 1 Replies View Related

Red Hat / Fedora :: Internal Error: No Mount Object For Mounted Volume

Apr 29, 2010

i'm installing a Linux system just simply following guide by fellow friends comunity. Currently, my box are having 2 HDD with 35GB each capacity. Displaying in GNome (36.2 GB Encrypted Data). During installation, I'd selected :

*Remove Linux partitions on selected drives and create default layout
*The "Encrypt system" option

View from terminal :

# /sbin/fdisk -l
Disk /dev/sda: 36.4 GB, 36401315840 bytes
255 heads, 63 sectors/track, 4425 cylinders


In Gnome desktop, when I right click and select mount volume, it will display : "Unable to mount location. Internal error: No mount object for mounted volume"

View 9 Replies View Related

Slackware :: Fatal Error: Glib-object.h: No Such File Or Directory

May 31, 2011

I'm using Slackware 13.37 x64 (upgraded to slackware-current) and I have trouble compiling mysql workbench 5.2.34.

The error is:


scintilla-marshal.c:2:25: fatal error: glib-object.h: No such file or directory

But I have that glib-object.h file:


$ locate glib-object.h

This is when I try to compile version 5.2.27:


./PlatGTK.cxx:13:21: fatal error: gdk/gdk.h: No such file or directory


$ locate gdk.h

View 12 Replies View Related

OpenSUSE :: Error Message - Cannot Open Shared Object File

Sep 10, 2011

Error while loading shared libraries: cannot open shared object file: No such file or directory

This is an Error message I am receiving through my SSH protocol while attempting to Execute a File on my Linux Server.

The file(s) im trying to execute are:

View 4 Replies View Related

Ubuntu Networking :: SNMP Error Message - Unknown Object Identifier

Mar 25, 2011

In both CentOS 5.5 and FreeBSD 7.4 when I use
snmpget -v 1 -c public windows_host system.sysDescr.0
I get the remote windows machine system description just fine. But not in ubuntu.
Searching snmp-net FAQ for the erroe message "Unknown Object Identifier", I got this to work around
snmpget -v 1 -c public SNMPv2-MIB::system.sysDescr.0
But it not worked either.. Searching "MIB" using apt-file search, I installed "snmp-mibs-downloader", and now
snmpget -v 1 -c public SNMPv2-MIB::system.sysDescr.0
works.. but
snmpget -v 1 -c public windows_host system.sysDescr.0
still breaks..
Why it works in CentOS and FreeBSD but not in Ubuntu?

View 2 Replies View Related

Networking :: Openldap Upgrade From 2.3.32 To 2.4.23 - Error 'no Structural Object Class Provided'

Aug 17, 2010

Currently I have a single openldap server version 2.3.32 preforming authentication on our databases as well as e-mail and other assorted programs. When we get a high volume of users, sometimes the users can not be authenticated for new e-mail sessions and what not. We have traced it back to being that our current single ldap server can not authenticate them all in a timely manner. We decided that we would put up a new ldap server and replicate the changes to it, then upgrade the older server version and replicate back to it so that both would have a current up to date copy of our configuration, and we would do a master/slave type setup.

Trying to replicate between the old server and the new server is not currently working. Here is the issue: when we try to import the schema's from the older server we get this error: slapadd: dn="cn=Domain Users,ou=Groups,dc=mydomain,dc=com" (line=247): (65) no structural object class provided I can not seem to find any information on google that shows this exact error? if this isn't detailed enough let me know what else I should post.

View 1 Replies View Related

General :: Error While Loading Shared Libraries - Cannot Open Object File

Apr 12, 2010

I am trying to create a package for Moblin using the Moblin Package creator application in Ubuntu. The RPM package gets created successfully, but when I execute that package in Moblin OS in the terminal I get the following error message: Error while loading shared libraries: cannot open shared object file: No such file or directory.

I understand that the above libraries are missing on my system and I need to add them. My question here is do I have to add them manually after the installation of the package or can the package itself include these libraries and copy them to proper locations when the package is installed. In case the libraries can be included in the package I want to know how that can be done.

View 1 Replies View Related

Programming :: Assigning Structure Object's Variable Outside Main() Gives Parse Error

Sep 2, 2010

Kindly take a look at the code below :

#include <stdio.h>
struct test
int i;
int j;


why i am getting this error. I know the error is occuring because i have assigned values to obj.i and obj.j outside main(). But i want to know why do that result in an error. From my part i have created an object 'obj' of stucture 'test' and assigned values to its variables.

View 7 Replies View Related

OpenSUSE Multimedia :: Org.freedesktop.DBus.Error.UnknownObject : No Such Object Path '/MainApplication'

Sep 8, 2010

Kmix will not start any more. It might have something to do with an online update I installed last night. Here is the output from a console. I can't make any sense of it.

ion@linux-4cfs:~> kmix
Connecting to deprecated signal QDBusConnectionInterface::serviceOwnerChanged(QString,QString,QString)
<unknown program name>(6735)/: Communication problem with "kmix" , it probably crashed.
Error message was: "org.freedesktop.DBus.Error.UnknownObject" : " "No such object path '/MainApplication'" "


View 9 Replies View Related

General :: Error 404 "PHP Code: Object Not Found' - Get PhpMyAdmin Work On LAMP Installed On OpenSuse 10.1?

Apr 24, 2009

get phpMyAdmin work on LAMP installed on OpenSuse 10.1 !!

running: "rpm -q" command result:

My problem is when trying to connect to: "hxxp://" I reported Error 404: PHP Code: Object not found! The requested URL was not found on this server. If you entered the URL manually please check your spelling and try again. If you think this is a server error, please contact the webmaster. Error 404


View 1 Replies View Related

Ubuntu :: Evolution Error Object Class EMFolderTree Doesn't Implement Property 'paste-target-list' From Interface 'ESelectable'

May 24, 2011

When I start evolution from the terminal I get this: (evolution:3265): GLib-GObject-CRITICAL **: Object class EMFolderTree doesn't implement property 'paste-target-list' from interface 'ESelectable' The program still starts though. I am fairly new to Ubuntu.

View 2 Replies View Related

Copyrights 2005-15, All rights reserved