Slackware :: Fatal Error: Glib-object.h: No Such File Or Directory

May 31, 2011

I'm using Slackware 13.37 x64 (upgraded to slackware-current) and I have trouble compiling mysql workbench 5.2.34.

The error is:

Code:

scintilla-marshal.c:2:25: fatal error: glib-object.h: No such file or directory

But I have that glib-object.h file:

Code:

$ locate glib-object.h
/usr/include/glib-2.0/glib-object.h

This is when I try to compile version 5.2.27:

Code:

./PlatGTK.cxx:13:21: fatal error: gdk/gdk.h: No such file or directory

Code:

$ locate gdk.h
/usr/include/gtk-1.2/gdk/gdk.h
/usr/include/gtk-2.0/gdk/gdk.h

View 12 Replies


ADVERTISEMENT

Ubuntu :: Src/main.h:25: Fatal Error: Glib.h: No Such File Or Directory

Oct 29, 2010

I am trying to install a program called airfart and when I run make after cd'ing to the appropriate file i get this

Code:

g++ -g `pkg-config gtk+-2.0 --cflags` -o src/main.o -c src/main.cpp
Package gtk+-2.0 was not found in the pkg-config search path.
Perhaps you should add the directory containing `gtk+-2.0.pc'

[code]....

View 9 Replies View Related

Fedora X86/64bit :: Libdbus-glib-1.so.2: Cannot Open Shared Object File: No Such File Or Directory

Jun 18, 2009

I've just installed F11 (x86_64) on my computer. I've been using x86_64 since Fedora 7 and normally I use a manually installed i386 firefox/thunderbird. This time I've tried to do the same using Fireox 3.5b4 but I got many troubles. The last error I got is:

./firefox-bin: error while loading shared libraries: libdbus-glib-1.so.2: cannot open shared object file: No such file or directory but that lib is not available on the standard repository. I've tried to use the i386 version of thunderbird (2.0.0.9) but I got this error: ./thunderbird-bin: error while loading shared libraries: libstdc++.so.5: cannot open shared object file: No such file or directory but on the repository there is just the libstdc++-4.4.0-4.i586 lib.

View 4 Replies View Related

Slackware :: Slapt-get Error On First Run - Cannot Open Shared Object File: No Such File Or Directory

May 22, 2011

I get an error when running slapt-get. The error is: "slapt-get: error while loading shared libraries: libsas.so.2: cannot open shared object file: No such file or directory".

I've booted the Slackware disk # 1 and unchecked everything except the libraries category and installed them. I rebooted and it still says this. I get this same error before I put the disk in and rebooted to install ALL libraries. I really need help. BTW, I can't load KDE.I found a pkg manager already installed called "slackpkg". But I really need help on this library issue!! I uninstalled it (slapt-get) anyway, so forget that!

View 3 Replies View Related

Slackware :: Libuuid.so - Cant Open Shared Object File - No Such File Or Directory

Sep 9, 2010

I tried to upgrade my slackware xfce 13.0 >> 13.1. I read "man slackpkg" first, and then I did exactly what I read at the man pages, my system was in init 1 mode.

The mirror I used it was the Greek mirror for 13.1. The command slackpkg upgrade-all was running ok until the "r" letter after that all packages did not upgraded because it was ERROR CHECKSUMS.md5 to all of them. Slackpkg did not upgrade all this packages but just check them and them skip them.

When everything stopped I reboot but at loading time it stops and I have this message: "libuuid.so.1:cannot open shared object file: No such file or directory."

After that I have 2 options to press control-d to reboot or to give root pass and login as root@(none):

After I login I cant connect to internet, I cant shutdown the system only reboot it from cl, I even cant go to init 1 or anything else. I dont know if I can fix the problem but I have to try...

View 2 Replies View Related

Slackware :: Libfam.so.0: Cannot Open Shared Object File: No Such File Or Directory

Jun 3, 2011

Code:

bash-4.1$ konqueror
konqueror: error while loading shared libraries: libfam.so.0: cannot open shared object file: No such file or directory

View 5 Replies View Related

Slackware :: Cannot Open Shared Object File: No Such File Or Directory

Mar 5, 2010

I just installed Alien Bob's HandBrake package and am getting a ton of warnings:

Code:
bash-3.1$ ghb
(ghb:27626): GStreamer-WARNING **: Failed to load plugin '/usr/lib64/gstreamer-0.10/libgstmpeg2dec.so': libmpeg2.so.0: cannot open shared object file: No such file or directory
(ghb:27626): GStreamer-WARNING **: Failed to load plugin '/usr/lib64/gstreamer-0.10/libgstsndfile.so': libsndfile.so.1: cannot open shared object file: No such file or directory

[Code]...

View 9 Replies View Related

Slackware :: Cannot Open Shared Object File: No Such File Or Directory?

Jul 23, 2010

I've been building a minimal Slackware system with a small number of packages installed (following this article of ). But now I'm facing a problem with a library call 'libmpfr' when installing the package 'pmount'. I have tried installing libmpfr from source but the installation also REQUIRED libmpfr. Code: error while loading shared libraries: libmpfr.so.1: cannot open shared object file: No such file or directory.The only solution I could come up with is to look for a precompiled libmpfr so that I can install it using installpkg. But nowhere could I find it by now.

View 2 Replies View Related

Slackware :: L 99 99 99 Pops Up - Fatal: Create /boot/map: No Such File Or Directory

Mar 4, 2011

Im sure that this issue is pretty old and you get some results from forums when you google it, but I cant seem to find the solution : When I boot my system ( its duel boot , win7 / Slackware 13.1 ) the message : L 99 99 99 pops up. I know this has to do with the MBR, When I looked online this is what people were told to do:

[Code]///

View 6 Replies View Related

General :: 6.13 GMP-5.0.0 LFS Make Error - Cannot Open Shared Object File: No Such File Or Directory

Jun 10, 2010

I'm currently stuck at 6.13 GMP-5.0.0 of the LFS installation. After running make, I receive the following:

error while loading shared libraries: libbfd-2.20.so: cannot open shared object file: No such file or directory
make[2]: *** [libmpn.la] Error 127
make[2]: Leaving directory `/sources/gmp-5.0.0/mpn'

[code]....

View 5 Replies View Related

Fedora :: Error - Cannot Open Shared Object File: No Such File Or Directory

Mar 4, 2010

i have a problem with realplayer 11 i can't open it due to that error message

Code:
/opt/real/RealPlayer/realplay.bin: error while loading shared libraries: libgdk-x11-2.0.so.0: cannot open shared object file: No such file or directory so how can reveal this problem

View 4 Replies View Related

Ubuntu Multimedia :: Audacious Libmowgli Error : Cannot Open Shared Object File: No Such File Or Directory?

Nov 12, 2010

Salutations,I've been struggling with getting audacious working for the past hour. I'm using synaptic to install it. When trying to run it from the bash, I'm getting the following error:

Code:
audacious: error while loading shared libraries: libmowgli.so.1: cannot open shared object file: No such file or directory.I tried to make /usr/lib/libmowgli.so->libmowgli.so.1 link, but it didn't help. Tried reinstalling audacious/libmowgli and a few others packages, but in vain, too.

View 2 Replies View Related

General :: Can't Compile Gcc - Fatal Error: Stdio.h: No Such File Or Directory

Feb 19, 2011

I am trying to upgrade my NAS with anew toolchain, gcc-4.5.2. The NAS have been "hacked" fonz_plug, that contain a gcc version 4.1.3 with uClibc. I have download all needed tar files and done the following.My goal is to upgrade the gcc to 4.5.2 and replace the ucLibc on the system with a GNU libc.

# Pass one
#
# binutils
./configure --prefix=/ffp --libdir=/ffp/lib --includedir=/ffp/include --with-gmp=/ffp --with-mpfr=/ffp
But when I try to compile the gcc with
../configure --prefix=/ffp --libdir=/ffp/lib --includedir=/ffp/include --enable-__cxa_atexit --with-float=soft --enable-languages=c,c++ --with-build-sysroot=/ffp --with-build-time-tools=/ffp/bin --with-system-zlib --enable-threads=posix --disable-bootstrap

[Code]...

View 6 Replies View Related

Ubuntu :: Fatal Error: Iostream.h: No Such File Or Directory Compilation Terminated While Compiling C++ Code

Dec 9, 2010

whenever i am trying to compile a c++ program i am getting the following error sample.cpp:1: fatal error: iostream.h: No such file or directory compilation terminated

View 1 Replies View Related

Fedora :: Error To Rebuild Inkscape Srpm Fedora 14 : Glib.h: No Such File Or Directory?

Dec 23, 2010

my problem is inkscape-0.48.0-1.fc14.3.src.rpm in fedora 14 64 bittry rebuild --source inkscape-0.48.0-1.fc14.3.src.rpm and this my error:I think something wrong pkgconfig .

attributes.cpp:20:32: fatal error: glib.h: No such file or directory
compilation terminated.
arc-context.cpp:21:28: fatal error: gdk/gdkkeysyms.h: No such file or directory

[code]....

View 6 Replies View Related

OpenSUSE Install :: Error While Loading Shared Libraries: Libvolume_id.so.1: Cannot Open Shared Object File: No Such File Or Directory

May 14, 2010

I upgrade the system from 11.1 to 11.2 seems everything work fine, no error no warning, after a reboot the consol show : mount error while loading shared libraries: libvolume_id.so.1: Cannot open shared object file: No such file or directory. when I try to repair the system the repair tool cannot find the root partion,

View 1 Replies View Related

Debian :: Error "cannot Open Shared Object File: No Such File Or Directory" Using Updatetool On Glassfish 3 (Squeeze 64 Bit)

Mar 2, 2010

Error "cannot open shared object file: No such file or directory" using updatetool on Glassfish 3 (Squeeze 64 bit)

[Code]....

View 5 Replies View Related

Fedora X86/64bit :: Play A 32bit Game On F14-64 - Error "cannot Open Shared Object File: No Such File Or Directory"

Dec 19, 2010

You may know the Humble Indie Pack 2, which is a set of crossplatform indie video games. There's one game in the bundle that doesn't offer a 64bit build and therefore it fails to load. It's called Braid and that's what you get when you try to run it: $ ./braid ./braid: error while loading shared libraries: libGL.so.1: cannot open shared object file: No such file or directory

Of course the 64bit libs for OpenGL and the propitiatory nvidia drivers are installed, but the game asks for the 32bit ones, at least to my understanding. I do know that why can install 32bit libraries on a 64 bit linux system (we do that for the sake of crappy Adobe Flash), but I don't know where to find these libs (searching the repo with keywords like .i586 or ia32 led me nowhere).

View 2 Replies View Related

Ubuntu Installation :: Error While Loading Shared Libraries: Libxcb-xlib.so.0: Cannot Open Shared Object File: No Such File Or Directory

Jan 15, 2010

how to install libxcb-xlib.so.0?When I start one software and it complains that

"error while loading shared libraries: libxcb-xlib.so.0: cannot open shared object file: No such file or directory"

I have lastest libxcb1 installed and searched in my system but didnot find a relevant result.

View 3 Replies View Related

Ubuntu Installation :: Lib_apt - Server Upgrade 10.10 To 11.04 - Error "cannot Open Shared Object File: No Such File Or Directory"

May 9, 2011

Attempt to upgrade 10.10 to 11.04 server installation (more or less plain vanilla) gives:

[Code]...

Tried reinstalling the obvious packages related to this, no change. Aptitude updates to 10.10 function without problems.

View 2 Replies View Related

Ubuntu :: Error While Loading Shared Libraries: Libbabl-0.0.so.0: Cannot Open Shared Object File: No Such File Or Directory?

Jan 17, 2010

I installed the latest Gimp beta and it worked fine but then I couldn't open it. I removed it and I reinstalled but it didn't work, so I installed the latest stable version (no beta) and it still does not work, when I open it form Terminal, this is the response:gimp: error while loading shared libraries: libbabl-0.0.so.0: cannot open shared object file: No such file or directory

View 3 Replies View Related

OpenSUSE Install :: Glib Error - GLib-GIO:ERROR:gdbusconnection.c:2279:initable_init: Assertion Failed

Mar 31, 2011

As root, type "zypper update" and get several lines of the following error:

**
GLib-GIO:ERROR:gdbusconnection.c:2279:initable_init: assertion failed: (connection->initialization_error == NULL)
Loading repository data...
Reading installed packages...

Nothing to do. Used zypper dup to upgrade from 11.3. Still have boot problems (will open another thread), but had major problems upgrading timezone. File downloads would reach some percentage of completion, then B/s would slowly reduce, to zero. Upgrade would halt until manually aborted. Solution was to manually download 5 timezone files and install them in a directory repository. File download did not specify just the timezone file, but also a part of the directory. Could this be part of the problem? example: ./rpm/i586/timezone-2011d-0.2.1.i586.rpm instead of just the file name.System is a Dell 3000 (Pentium 4, 512MB memory).

View 5 Replies View Related

Ubuntu :: Modprobe Fatal Error "no Such File Or Directory" On Boot

Oct 13, 2010

since the recent upgrade to Maverik every time I boot this error message appear on the top of the screen: "modprobe: Fatal: Could not load /lib/modules/2.6.35-22-generic/modules.dep: no such file or directory" fter that plymouth starts without any graphics and the first visible object is the login interface (GDM)

View 1 Replies View Related

Ubuntu :: Can't Find Xlib.h - Fatal Error: Xlib.h: No Such File Or Directory

Jun 12, 2011

I'm trying to build a program called Obpager, but I'm getting an error saying I don't have xlib.h. From what I understand, that file is included in libx11-dev, which I have installed. Any idea?

Code:

dagoss@MAGIC-PORT:~/Downloads/obpager-1.8$ make
Compiling src/main.cc
In file included from src/main.cc:33:0:

[code]....

View 2 Replies View Related

Ubuntu :: Fatal Error: Gdk-pixbuf/gdk-pixbuf.h: No Such File Or Directory

Oct 2, 2010

I have updated to ubuntu 10.10, but when I try to compile chromium on ubuntu, I get this error:

Code:

In file included from /usr/include/gtk-2.0/gdk/gdkcairo.h:28,
from /usr/include/gtk-2.0/gdk/gdk.h:33,
from app/active_window_watcher_x.cc:6:
/usr/include/gtk-2.0/gdk/gdkpixbuf.h:37: fatal error: gdk-pixbuf/gdk-pixbuf.h: No such file or directory

What I don't understand is why gtk-2.0/gdk/gdkpixbuf.h complains that gdkpixbuf/gdk-pixbuf.h is not found. And how can I fix it?

View 7 Replies View Related

Programming :: Libmysqlclient Error "libmysqlclient.so.14: Cannot Open Shared Object File: No Such File Or Directory" On Ubuntu 9.10

Apr 1, 2010

I am currently using Ubuntu 9.10. I am writing a small code in C which test the connectivity with MYSQL. I am getting this error. "libmysqlclient.so.14: cannot open shared object file: No such file or directory" What I understand is that you need MYSQL development package in order to access MYSQL database in C. I installed MYSQL using this command. apt-get install mysql-server mysql-client

View 2 Replies View Related

Slackware :: Ark: Error While Loading Shared Libraries: Liblzma.so.0: Cannot Open Shared Object File

Jan 26, 2011

After finally getting my wireless/graphics drivers working yesterday (thanks to this forum ) I startx to realize that not a single KDE/Qt application will launch, along with Firefox, or Chrome/Chromium. (I did a full install from the DVD, not deselecting anything, and when I upgraded to -current, I also did the same.)

Ark said:

Quote:

ark: error while loading shared libraries: liblzma.so.0: cannot open shared object file: No such file or directory

but I managed to fix that one by commenting out 'aaa_elflibs' in /etc/slackpkg/blacklist (on a recommendation from #slackware), and running slackpkg upgrade-all again, but that's the only one (afaik) that was fixed. Ark still doesn't work, but it doesn't show that error anymore. When I run it, a box pops up that says "Unable to find Ark's KPart component, please check your installation."

Kate still says:

Quote:

kate: error while loading shared libraries: libkemoticons.so.4: cannot open shared object file: No such file or directory

Now, konsole, firefox, and Chromium's errors are a little different.

Konsole:

Quote:

konsole: symbol lookup error: /usr/lib/libphonon.so.4: undefined symbol: _ZN9QMetaType15registerTypedefEPKci

Firefox and Chrome basically say the same thing

Quote:

/usr/lib/firefox-3.6.13/firefox-bin: symbol lookup error: /usr/lib/mozilla/plugins/skypebuttons.so: undefined symbol: _ZN9QListData11detach_growEPii

again, I am completely baffled here, as I had kate, konsole and ark running before I upgraded to -current.

View 5 Replies View Related

Ubuntu Servers :: Postfix Make Install - Error - Postfix: Fatal: Chdir(/usr/libexec/postfix): No Such File Or Directory

Mar 11, 2010

Here is what i do: make clean make makefiles CCARGS='-DEF_CONFIG_DIR="/opt/product/postfix-2.6.5/etc"

-DEF_COMMAND_DIR="/opt/product/postfix-2.6.5"
-DEF_DAEMON_DIR="/opt/product/postfix-2.6.5/libexec"
-DEF_MAILQ_PATH="/opt/product/postfix-2.6.5/bin/mailq"
-DEF_DATA_DIR="/opt/product/postfix-2.6.5/lib"
-DEF_NEWALIAS_DIR="/opt/product/postfix-2.6.5/bin/newaliases"
[Code]...

make install then i got this error: postfix: fatal: chdir(/usr/libexec/postfix): No such file or directory make: *** [install] Error 1 I don't understand why it's checking the usr/libexec folder for the daemons although I've set the folder to /opt/product/postfix-2.6.5/libexec in the makefile. Here is also the cat of my makedefs.out:

[Code]....

View 1 Replies View Related

Ubuntu Installation :: Libotcl.so: Cannot Open Shared Object File: No Such File Or Directory

Feb 15, 2010

there are number of threads floating on installation of ns2..however i am unable to get it on my 64 bit system ns: error while loading shared libraries: libotcl.so: cannot open shared object file: No such file or directory

View 1 Replies View Related

Ubuntu Multimedia :: Libpython2.5.so.1.0 - Cannot Open Share And Object File: No Such File Or Directory

Jul 27, 2010

When running the beta of blender 2.5, I get the following error. blender: error while loading shared libraries: libpython2.5.so.1.0: cannot open shared object file: No such file or directory In previous versions of ubuntu you could 'apt-get install python2.5' to resolve the issue, but it doesn't appear in any/all of the repositories. where I can get python2.5 for lucid-lynx?

View 1 Replies View Related







Copyrights 2005-15 www.BigResource.com, All rights reserved