Slackware :: Error With Gnome Slack Build (GSB) - ((Error Org.freedesktop.DBus.Error.AccessDenied.))

Jan 19, 2011

after install slackware with gnome using gnome slack build it is work fine Except some thing :-

the volume it is not work and get this error ((The volume control did not find any elements and/or devices to control. This means either that you don't have the right GStreamer plugins installed, or that you don't have a sound card configured. You can remove the volume control from the panel by right-clicking the speaker icon on the panel and selecting "Remove From Panel" from the menu.

No volume control GStreamer plugins and/or devices found.)) and the System Monitor give me this error when i want check the state of memory and processor ((There was an error executing 'gnome-system-monitor': Failed to execute child process "gnome-system-monitor" (No such file or directory)) and the memory flash not work and give me this error ((Error org.freedesktop.DBus.Error.AccessDenied.))

View 6 Replies


Ubuntu :: Error Mounting DVD / DBus Error Org.freedesktop.DBus.Error.NoReply: Did Not Receive A Reply?

Mar 17, 2009

I'm not sure what when wrong since I have a few DVDs and they all play well in my normal DVD player, I later attempt to mount it in my Ubuntu 8.10 I'm presented with the following message:

DBus error org.freedesktop.DBus.Error.NoReply: Did not receive a reply. Possible causes include: the remote application did not send a reply, the message bus security policy blocked the reply, the reply timeout expired, or the network connection was broken.

May I know what does this really mean?Is there something in my computer that require a fix?

View 2 Replies View Related

Ubuntu :: U9.10 - Unable To Mount Audio Disc DBus Error Org.freedesktop.DBus.Error.InvalidArgs: Mountpoint Already Registered

Jan 13, 2010

When I install a commercial audio into the CDROM drive I get th following: Unable to mount Audio Disc DBus error org.freedesktop.DBus.Error.InvalidArgs: Mountpoint Already registered

View 1 Replies View Related

Fedora :: 15 - Iphone Won't Mount - DBus Error Org.freedesktop.DBus.Error.NoReply: Message Did Not Receive A Reply

Jul 5, 2011

when I connect my iphone (3GS, 4.3.3) to Fedora 15 it gives me this error: Unable to mount iphone
DBus error org.freedesktop.DBus.Error.NoReply: Message did not receive a reply (timeout by message bus). The weird thing: after looking in var/log/messages it appears that it is trying to be used by NetworkManager. And when I lookin NM, i can see iPhone as an ethernet device (cable unplugged).

View 4 Replies View Related

OpenSUSE Multimedia :: Org.freedesktop.DBus.Error.UnknownObject : No Such Object Path '/MainApplication'

Sep 8, 2010

Kmix will not start any more. It might have something to do with an online update I installed last night. Here is the output from a console. I can't make any sense of it.

ion@linux-4cfs:~> kmix
Connecting to deprecated signal QDBusConnectionInterface::serviceOwnerChanged(QString,QString,QString)
<unknown program name>(6735)/: Communication problem with "kmix" , it probably crashed.
Error message was: "org.freedesktop.DBus.Error.UnknownObject" : " "No such object path '/MainApplication'" "


View 9 Replies View Related

Slackware :: Build Handbrake Error - Gtk.install - Error 2

Aug 14, 2010

I need handbrake software so badly so I went to alien's slackbuild to download the handbrake.However,it ends with error after compiling-

Does it mean i miss something of gtk?

View 8 Replies View Related

Programming :: Error: Dbus/dbus-protocol.h: No Such File Or Directory

Jan 24, 2011

do have installed glib and dbus and can find them manually , /usr/include/glib-2.0/glib.h , but while comipling applicaiton it gives following error messages.

/usr/include/libosso.h:32:18: error: glib.h: No such file or directory
/usr/include/libosso.h:38:23: error: dbus/dbus.h: No such file or directory
/usr/include/libosso.h:39:32: error: dbus/dbus-protocol.h: No such file or directory

View 1 Replies View Related

Slackware :: Error Building Glade3 - Build ?

Jan 21, 2011

Im trying to build the glade3 slackbuild on slackware x64 -current, but everytime i try to build it, i get the same error:


There are no dependencies listed in the slackbuild, so i'm confused as to what could be causing this error.

View 5 Replies View Related

Debian Multimedia :: Gnome 2.30 Build - LibIDL Make Error

Apr 7, 2010

Did not find much here regarding building Gnome 2.30 from source. I'm using jhbuild to build the gnome 2.30 desktop. I have everything, to my knowledge, installed to build gnome. I get an error when trying to build the libIDL library. Anyone have any clue as to what I need installed or changed in the configuration file to build libIDL?

View 1 Replies View Related

Slackware :: DBUS / Compiz In Slack 13.1?

Jul 9, 2010

i installed compiz fusion on my slack 13.1 i installed in the good order all the packages nevetheless when i try to use DBUS in command line i don't have any response from compiz
here is one example

dbus-send --type=method_call --dest=org.freedesktop.compiz /org/freedesktop/compiz/switcher/allscreens/next org.freedesktop.compiz.activate string:'root' int32:`xwininfo -root | grep id: | awk '{ print $4 }'`but no reaction .what can i check to have a functionnal DBUS ?

View 3 Replies View Related

OpenSUSE Multimedia :: Error - Auth_admin_keep_always

Jul 17, 2010

I am trying to play or backup various DVDs i have recently bought and keep geting this error message: (mind the wrap) auth_admin_keep_always <-- (action, result) from KIOExec What in tarnation is going on. How about a useful error message.

View 9 Replies View Related

Ubuntu :: Installing Emacs 23.1 - Error "makeinfo Is Missing - Cannot Build Manuals Make: *** [info] Error 1 **** Installation Failed"

Feb 6, 2010

I've been trying to install the latest version of Emacs from source but I'm running into a trouble. The commands "./configure" and "make" work just fine. However, when I run "sudo checkinstall" I get a message saying that makeinfo is missing:

Code: makeinfo is missing - cannot build manuals make: *** [info] Error 1 **** Installation failed. Aborting package creation. Cleaning up...OK Bye. What is Error 1

View 4 Replies View Related

General :: Error - The Action Could Not Be Completed Because The Name Org.freedesktop.packagekit Was Not Provided By Any .service Files

Feb 17, 2010

i recently install openoffice in fedora 12 and error occured the error is : the action could not be completed because the name org.freedesktop.packagekit was not provided by any .service files. what is link to download latest openoffice for my fedora 12,?my laptop model is asus k50in.

View 1 Replies View Related

Slackware :: "L 02 02 02" Error On When Upgrading To Slack 13.37?

Jun 22, 2011

I just upgraded from 13.1 to 13.37 and I'm getting the L 02 02 02 error. This means that lilo can't find the partition it's told to boot. It's strange because:

- I haven't tweaked anything in the hardware
- I kept the same partitions, just formated
- I'm using ext3, as with 13.1
- I installed lilo on MBR (while on setup, and later with -M /dev/sda)
- I choose the huge smp kernel, as with 13.1
- I have only two partitions, root (sda1) and swap (sda2)
- the root partition is the active one (asterisk), on fdisk

So I tried:

- reseting the BIOS
- removing the UTF8 setting on lilo.conf
- using the lilo.conf that worked with 13.1

They all failed. I don't even know what to try!

PS: The hardware is a Pentium 4 1500Mhz with 512MB RAM on Asus P4B.

View 5 Replies View Related

Ubuntu :: I Shared A Folder From Gnome - Get An Error : 'net Usershare' Returned Error 255?

Dec 10, 2010

I logged in as user1 with administrative privileges.I right-clicked on a folder on my desktop, then "Sharing Options", then shared the folder as "docs".Then I created a new user with administrative privileges, user2, and logged in as that user.Then, I deleted user1 - account settings, and files.Then I created a folder on my desktop and tried to share it as "docs", but I get the following error: 'net usershare' returned error 255: net usershare add: failed to add share docs. Error was Operation not permitted

I can share the folder as any other name, just not "docs".My smb.conf file doesn't contain the entry.I'd love to know where the configuration file is that's hi-jacked the name "docs".

View 1 Replies View Related

Slackware :: Modprobe Kvm-intel Gives An Error - FATAL: Error Inserting Kvm_intel

Jul 2, 2010

I've just install qemu-kvm from [URL]

I run modprobe kvm and modprobe kvm-intel to load the modules, but the second command won't work.

It gives the following error -


root@mika:/home/mika# modprobe kvm-intel

FATAL: Error inserting kvm_intel (/lib/modules/ Operation not supported

View 10 Replies View Related

Slackware :: Error Make[2]: *** [lib/] Error 1

Oct 14, 2010

I was having a go at compiling the latest Amarok 2.3.2. As I run make I get the following error

make[2]: *** [lib/] Error 1
make[1]: *** [src/core-impl/collections/sqlcollection/mysqlecollection/CMakeFiles/amarok_collection-mysqlecollection.dir/all] Error 2
make: *** [all] Error 2

I'm running Slackware64-current. how to prevent this error arising?

View 13 Replies View Related

General :: Dbus Installation - Gives Error

May 10, 2009

I'm trying to install dbus-1.2.12, but configure gives me the error


I'm using Slackware 11, does anyone know how to solve this and compile successfully the library?

View 3 Replies View Related

Debian :: Internal Error While Installing Dbus-x11

Jul 8, 2015

I am trying to debug the installation. One of the sub-processes that does not install correctly is dsub-x11, which gives me following error:

E: Internal Error, No file name for dbus-x11:i386

View 10 Replies View Related

OpenSUSE :: DBus Error : Unable To Get Transaction Id

May 30, 2010

After an udate I get this error message: DBus error : Unable to get transaction id from packagekit. This error also shows when I click the yellow triangle. When I start the manual update this shows:


It seems some shell is not there anymore. What to do?

View 9 Replies View Related

Ubuntu :: DBus Error: Unable To Mount

Mar 3, 2010

Ubuntu 9.04-amd64 After a recent update every time I insert a cd/dvd or usb flash drive I get the following error popup.

View 1 Replies View Related

Ubuntu :: Tweak Unlock Dbus Error

Jul 13, 2010

When I click unlock in UT it doesn't do anything. Here is my terminal output...I've tried install/reinstall a dozen times.

ERROR:dbus.proxies:Introspect error on :1.61:/com/ubuntu_tweak/daemon: dbus.exceptions.DBusException:

org.freedesktop.DBus.Error.AccessDenied: Rejected send message, 1 matched rules; type="method_call", sender=":1.60" (uid=0 pid=23463 comm="/usr/bin/python) interface="org.freedesktop.DBus.Introspectable" member="Introspect" error name="(unset)" requested_reply=0 destination=":1.61" (uid=0 pid=23468 comm="/usr/bin/python))

View 1 Replies View Related

General :: AWK Error In Slack 13

Jan 13, 2010

I install Slackware on Virtual Box with 02 Nic (Eth0: wan, eth1 :local), config iptable , bind for a small network, it works fine local PC can go internet and use DNS cache.

I try slack update and get the following error:

slackpkg update

awk package not found! Please install awk before you run slackpkg, as slackpkg cannot function without awk.

I try which awk

which awk
which: no awk in (/usr/local/sbin:/usr/sbin:/sbin:/usr/local/bin:/usr/bin:/bin:/usr/games)

View 7 Replies View Related

Slackware :: Error Building Gnome-power-manager 2.30

May 20, 2010

I use Slackware 13.0 with the kernel, and I use GnomeSlackbuild.I tried to get help on their discussion group, but I didn't get any.I'm trying to build gnome-power-manager 2.30, because it uses the new upower interface (so it seems). I have GTK+ 2.18.9.

View 3 Replies View Related

Ubuntu :: Installing Windows - BSOD Error (0x0000007B) And Error With Setupdd.sys (error Code 4)

Jun 27, 2011

If I have a hard-disk with Ubuntu fully installed on it and I want to - all of a sudden - use Windows XP, is it mandatory that I firstly format the hard-disk first? So far, I have used two versions of Windows XP; one of them is from a few years before the other. Both copies of Windows XP when in start-up from booting from CD are causing errors. One of them is a BSOD error (0x0000007B) and the next Windows CD is stopping and giving me an error with setupdd.sys (error code 4). Is it required that the hard-disk is formatted before you even put a Windows boot CD in?

View 2 Replies View Related

OpenSUSE :: DBus Error : Unable To Get Transaction Id From Packagekit

Feb 19, 2010

I just installed 11.2 kde 64 bit and I get this error: DBus error : Unable to get transaction id from packagekit. How do I correct this?also: the other updates have been running for a hour and they're still running. is this normal?

View 3 Replies View Related

Ubuntu :: Unable To Mount Ipod DBus Error

Jan 30, 2010

I've had my Ipod working fine using both Rhythmbox and gtkpod until a few weeks ago. Now, I can't get my Ipod to mount. My external hard drive mounts fine, just not the Ipod. When I plug it in I get the following message:

"DBus error org.gtk.Private.RemoteVolumeMonitor. Not Found: The given volume was not found"

I've tried to manually mount it and that doesn't work. I updated from Jaunty to Karmic hoping that would solve it. It didn't.

View 3 Replies View Related

Hardware :: DVD / CDs Won't Mount After Recent Upgrade To 9.04 DBus Error

Feb 11, 2010

Unable to mount (DVD name) DBus error org.gtk.Private.RemoteVolumeMonitor.Failed: An operation is already pending I recently upgraded to 9.04. Installed medibuntu, ect, but still have this problem. I did not have the problem when I was using Hardy. The DVD I used yesterday was named "TNGS3D1", and though it showed up under places, clicking on the icon (right or left clicks) gave me the message above. Restarting and manually ejecting the DVD did nothing for it. I was able to finally mount the DVD yesterday, and operate it properly, after having this probem for several hours. I don't know why it suddenly worked, or why it doesn't now.

After using the DVD, I unmounted the icon on the desktop, but it is still listed under places. Today, I went to use another DVD, called "TNGS3D2". Again, it is listed under places, but it does not show up on the desktop. clicking on the icon just gives me the message again. Actually, now that I've typed all this, it's shown up on the desktop and works properly. (after approx. 20 min since closing the DVD tray) Is it jut slow? What can I do to fix all this? Why is yesterday's DVD still listed under places?

View 10 Replies View Related

Slackware :: [13.1-x86_64] GnuCash Compile Error : Gnome-utils

Jun 23, 2010

error message

mv -f .deps/gnc-icons.Tpo .deps/gnc-icons.Plo
mv -f .deps/gnc-html.Tpo .deps/gnc-html.Plo
make[5]: Leaving directory `/tmp/SBo/gnucash-2.2.9/src/gnome-utils'
make[4]: *** [all-recursive] Error 1
make[4]: Leaving directory `/tmp/SBo/gnucash-2.2.9/src/gnome-utils'
make[3]: *** [all] Error 2


I'm using SBo script to compile gnucash, with all the listed dependencies built successfully (in orderly manner). System multilib is configured as per alien's wiki. Is there something else I'm missing here?

View 9 Replies View Related

Slackware :: Update Old Slack Build Scripts?

Oct 11, 2010

how do I up date old slack build scripts the one I have in mind is this one [URL] I'm running slackware64-13.1 multilib this script was I think written slack 11

View 1 Replies View Related

Copyrights 2005-15, All rights reserved