Programming :: Rectify This Error: RCC: Error In 'appchooser.qrc': Cannot Find File 'akregato?

Apr 12, 2011

how to rectify these errors..
RCC: Error in 'appchooser.qrc': Cannot find file 'accessories-dictionary.png'
RCC: Error in 'appchooser.qrc': Cannot find file 'akregator.png'
RCC: Error in 'appchooser.qrc': Cannot find file 'digikam.png'
RCC: Error in 'appchooser.qrc': Cannot find file 'k3b.png'
RCC: Warning: No resources in 'appchooser.qrc'.

and my .qrc file is like this

<!DOCTYPE RCC><RCC version="1.0">

View 3 Replies


Programming :: Find Command With Standard Error Output And Mail Error File

Nov 11, 2010

We make everyday a DB Mysql backup on Linux redhat Enterprise. We are using a bash shell script (and putting it in the crontab) to execute it automatically everyday. We added a line to this script telling, once the backup has completed, to find old backup files (stored on hard disk after each backup) older than x days to remove them. We use the find command (search for file type) with the mtime option and in combination with rm command. Everything runs ok but we also want to add some new code to the same line: If find command cannot find anything or fails, for example if it cannot delete file or fails, send the error message (standard error output) to an error file (like error000001 and increasing) and mail the errorxxxx file to an email address for example to What would be the code for this issue to add it to our find command in the same bash shell script??

View 2 Replies View Related

Software :: Grub (Hard Disk Error) How To Rectify From Live CD

Jan 29, 2010

I've a dual installation, ubuntu and XP and I've suddenly got a problem when I boot it gives the error "GRUB: Hard Disk Error", Tried to boot from Ubuntu live CD but I don't know how to correct grub from there. How can I correct the problem, maybe which live disk is better to correct such errors?

Consulted similar threads but couldn't find a solution for my problem as I'm booting from livecd and others were giving solution as if one can directly access the installation on hard disk, but whenever I try with ubuntu livecd it access live installation.

View 2 Replies View Related

Ubuntu :: Error "Could Not Find A Compatible Opengl Display Resolution. Please Check Your Driver Configuration. (Error: Couldn't Find A Matching GLX Visual)"

Jul 22, 2011

I am having issues with 3d I am trying to start up a game called auteria but it displays this error "Could not find a compatible opengl display resolution. Please check your driver configuration. (Error: Couldn't find a matching GLX visual)" I am on ubuntu 10.10 could anybody give me a solution on how to fix this issue?

View 5 Replies View Related

Programming :: Proofread Prompt / Small Error Can't Find?

Jun 1, 2011

I've set the following as my prompt:... can't post the string due to the 15 post rule. how helpful....

Everything looks fine initially.
1- It sets the username and host in back on green text.
2- It then changes to an off-white an prints the command number for the terminal.
3- Next, it prints the working directory.
4- Finally is prints a ">" character and a space. it looks like this (hostname/un edited & image enlarged slightly to make it easier to read.)

The problem occurs when I try to "up arrow" to reuse and/or edit a prior command. It prints the prior command fine, but if I arrow over to edit the command sometimes the first character can not be deleted from displaying

I'd love to post 2 screen-shots I took to show the problem but.. 15 posts?

View 1 Replies View Related

OpenSUSE :: Get An Error That It Can Not Find A Library File?

Aug 22, 2011

It is a digital simulation program that works with QUCS which is anelectrical circuit simulator.I can compile it and install it using the normal:

sudo make install


View 4 Replies View Related

Ubuntu :: Cant Find Info Anywhere Else - Error Opening File

Apr 4, 2011

I have been comileing that kinect hack with the 3d video capture. i did everything, calibrated cameras and everything else but when i try to open the final program (KinectViewer) i get back this error: Caught exception Misc::File: Error opening file CameraCalibrationMatrices-B00363201643043B.dat in mode rb. From what ive gathered off the web it is not opening it because its in binaly mode or something to that affect. any tips to fix it? is there a way to change what mode im in?

View 2 Replies View Related

Server :: NFS Large File Copies Fail - Error Writing To File: Input/output Error?

Jun 27, 2009

I recently upgraded my file/media server to Fedora 11. After doing so, I can no longer copy large files to the server. The files begin to transfer, but typically after about 1gb of the file has transferred, the transfer stalls and ultimately fails with the message:

"Error writing to file: Input/output error"

I've run out of ideas as to what could cause this problem. I have tried the following:

1. Different NFS versions: NFS3 and NFS4
2. Tried copying the files to different physical drives on the server.
3. Tried copying the files from different physical drives on the client.
4. Tried different rsize and wsize block sizes when mounting the NFS share
5. Tried copying the files via a different protocol. SSH in this case. The file transfers are always successful when I use SSH.

Regardless of what I do, the result is the same. The file transfers always fail after approximately 1gb.

Some other notes.

1. Both the client and the server are running Fedora 11 kernel

I am out of ideas. Has anyone else experienced something similar?

View 13 Replies View Related

OpenSUSE Install :: Error In Installing Gcc 4.5.0 - Error Couldn't Find The C Compiler

Sep 9, 2010

i tried to install gcc-4.5.0 on opensuse 11.2 I gave ./configure but it gave the error couldn't find the c compiler.. the message was


View 2 Replies View Related

Server :: SVN Checkout Error - Can't Find A Temporary Directory - Internal Error

Feb 14, 2011

I have builded a svn server using apache before. But recently I can not check out from the svn server,and error code is as follows:

svn: Can't find a temporary directory: Internal error

I have searched in the google,they said no space on the server.But my server have much space.

Filesystem Size Used Avail Use% Mounted on
/dev/sda1 49G 22G 24G 48% /
tmpfs 220M 0 220M 0% /dev/shm
/dev/sdb1 917G 867G 3.8G 100% /mnt/md0
/dev/hda1 151G 129G 15G 91% /mnt/meego

The server is at the /dev/hda1 partition.

View 7 Replies View Related

Ubuntu Installation :: 10.10 Installed On USB - Error Message - Could Not Find Some File

Dec 14, 2010

Iv installed ubuntu 10.10 onto a usb 4gb pen. EVerything works fine. However I then wanted to encrypt the USB using truecrypt inside ubuntu and got an error message telling me it could not find some file. I then installed virtualbox onto the ubuntu this installed fine,i then installed windows xp and after completion clicked save the state. I then restarted ubuntu and when it loaded up again the virtualbox and windows xp had been deleted. Iv tried this twice just to make sure but same thing both times.

View 9 Replies View Related

General :: Runtest Error: Couldn't Find Library File Gcc-dg.exp

Sep 16, 2010

I am trying to run i386 in gcc_test-suite using dejagnu runtest and it fails with error given below. I can see that gcc-dg.exp is in folder gcc-4.6-20100911/gcc/testsuite/lib, but runtest is not searching in this folder.

how to resolve this issue and run only i386 tests.

$ cd /gcc-4.6-20100911/gcc/testsuite/
$ runtest -a -tool i386 -verbose
Looking for library file /usr/local/share/dejagnu/lib/gcc-dg.exp


View 6 Replies View Related

General :: Find Command Give Error File Not Found?

May 27, 2011

find /var/spool/mqueue -group abc -exec rm -rf {} ;Using above command , I delete all the files belong to group abc.Now the problem i face is that the this command gives error that some files are missing . And this error occur because after creating list of files, it pass that list to rm -rf but till that time sendmail process queue and some of files disapper from /var/spool/mqueue.

View 5 Replies View Related

Programming :: Eedirect Stderr To File Including Name Of File With Error

Jul 26, 2010

It's kind of pointless imo for the types of errors that Exiv2 reports on to be written to a text file without some reference to the name of the file that prompted the error message in the first place. Is there a way to have bash identify the file that prompts the error and writes its name to the same file as the error (in my case, frencherrors.TX)?I've tried a painfully simple syntax that does something identical to a 2>&1 'suffix", namely 2 $file>>frencherrors.TX. It makes sense to me as written, but I'd like to know why I'm getting nothing on screen and everything directed to the file when what I want to see in the latter are the filenames causing the errors along with the text of the errors.

Is there another level one has to bore down into before they can garner this kind of output? If so, what is it and how does one invoke it in bash?

View 11 Replies View Related

Ubuntu :: Gopenvpn Compile Error - Cannot Find Input File: `po/'

Mar 6, 2010

Ubuntu 9.10 64-bit
Lenovo T400

I'm trying to install gopenvpn from source. [URL] I'm pretty sure I have all the necessary libraries installed.

./configure ends with:
configure: creating ./config.status
config.status: creating Makefile
config.status: creating pixmaps/Makefile
config.status: creating src/Makefile
config.status: error: cannot find input file: `po/'

View 4 Replies View Related

Ubuntu :: Mount Iso File - ERROR: Modinfo: Could Not Find Module Loop

Dec 4, 2010

I'd like to mount an iso file ,however, it failed as following: ljk@ljk-laptop:~/Test$ modinfo loop ERROR: modinfo: could not find module loop what I can do?

View 1 Replies View Related

Ubuntu :: Can't Install - ERROR WindowsBackend: [Errno 2] System Can't Find File Specified

Sep 21, 2010

I'm having a problem installing Ubuntu using wubi. I get the error:

09-20 23:51 DEBUG TaskList: ## Running uncompress_target_dir...
09-20 23:51 ERROR WindowsBackend: [Errno 2] The system cannot find the file specified

and later on in the log:


View 1 Replies View Related

Software :: Getting Error While Unzipping A UNIX ZIP File - Cannot Find Zipfile Directory

Feb 18, 2011

I am facing an issue, while unzipping an UNIX ZIpped file. The message I am getting is as below.

/> unzip

End-of-central-directory signature not found. Either this file is not a zipfile, or it constitutes one disk of a multi-part archive. In the latter case the central directory and zipfile comment will be found on the last disk(s) of this archive. unzip: cannot find zipfile directory in one of or, and cannot find, period.

View 4 Replies View Related

Ubuntu :: Error While Installing 9,10 (unable To Find Medium Containing Live File System)

May 21, 2010

I am trying to install Ubunto 9.10 on my windows XP. I try to run it from the live cd. but every time i try to do this.. I get an error "Unable to find a medium containging live file system" I tried it from different cds too... so it's not an error in the cd.

View 2 Replies View Related

General :: Using Find With File Name And Mtime To Remove Files Gets Arg List Too Long Error?

Dec 25, 2009

I need to delete all *.trc files that are older than 30 days and I am getting a "Argument list too long" error. There are other files that should not be deleted which is why I am using the "*.trc" and newer files need to be kept as well. I have seen other postings but they do not cover both of the conditions. Below are 2 of the many attempts at doing this but I cannot get this to work.

find *.trc -mtime +31 -print| xargs rm -f {}
find *.trc -mtime +31 -print -exec rm -f {} ;

View 3 Replies View Related

Slackware :: Error: Could Not Find The File That Is Generated By Gnome-libs Install

Apr 13, 2010

Today i download cheops source code and when i type ./configure returns me this error :

checking for gnome-config... no checking for file in /usr/local/lib... not found configure: error: Could not find the file that is generated by gnome-libs install Is there any way to install cheops in KDE ? Do you know any solution for this problem ?

View 9 Replies View Related

Programming :: Error: Gtk/gtk.h: No Such File Or Directory

Feb 13, 2011

gcc kk.c : kk.c:1: fatal error: gtk/gtk.h: No such file or directory compilation terminated.

View 1 Replies View Related

Programming :: UDP File Transfer Error?

Apr 28, 2011

I have an assigment to create UDP file transfer with checksum,but currently i have a problem in transferring the data. The problem is:A.I sent a text file that have approximately 200kb but in the client receive only 100kb... is it fair?B.For text file,I track the result and i found that its okay for the text file. Write counter show 1024 byte every packet i sent. But when i sent mp3 file or pdf file it doenst show like this. For mp3 the data sent every packet i sent is gradually decreased from 1024 byte 1020byte contiounusly.... For pdf data its seems random.

View 6 Replies View Related

General :: Unable To Find Medium With Live File System - Error In Ubuntu Installation

Dec 1, 2009

I had been trying to install Ubuntu 9.10 after formatting my machine. When i select install of the welcome screen, the logo blinks for few minutes and then displays a error as


Unable to find medium with live File System

Then goes to busy box.

"The same thing appears with Ubuntu 8.10, which i was using before!"

View 2 Replies View Related

Programming :: Error: Sys/timerfd.h: No Such File Or Directory

Mar 8, 2011

In my project iam using timerfd.h file info. I included it header file, Iam using "arm-none-linux-gnueabi-gcc" compiler. This file exists in "arm-2010q1/arm-none-linux-gnueabi/libc/usr/include/sys". When i try to execute the program iam getting error: sys/timerfd.h: No such file or directory. remaining files able to find from the same location(sys/time.h, sys/ioctl.h,sys/socket.h).

#include <stdio.h>
#include <stdlib.h>
#include <string.h>
#include <time.h>
#include <signal.h>


View 1 Replies View Related

Programming :: Svnsync File Not Found Error

Apr 6, 2010

I'm trying to do a svnsync of this public repo: so I can access the repo when my machine is offline. I get this error at revision 419 svnsync: File not found: transaction '419-bn', path '/devel/Scripts/Engines/Doom/Lamp Room/LampController.cs'

I am using svnsync, version 1.6.5 (r38866)

View 6 Replies View Related

Ubuntu Installation :: Error - The Boot Configuration Data Store Could Not Be Opened - The System Cannot Find The File Specified

May 24, 2011

every-time i try to install, i get this

Error executing command
>>command=C:Windowssysnativecdedit.exe /create/d Ubuntu/application bootsector
>>stderr=The boot configuration data store could not be opened
The system cannot find the file specified

View 1 Replies View Related

Programming :: Library Linking - ELF File OS ABI Invalid Error

May 6, 2010

[root@shankar-lx src1]# make
gcc -c main.c
gcc -c database.c
gcc -c e_sqlite.c
gcc -o TEST main.o database.o e_sqlite.o /usr/local/lib/ -w -lpthread
[root@shankar-lx src1]# ./TEST
./TEST: error while loading shared libraries: /usr/lib/ ELF file OS ABI invalid

My application compiled well but when try to run, it is giving ELF file OS ABI invalid ERROR. What is this error.
Kernel version is 2.4-18

View 1 Replies View Related

Programming :: Parse Error: Syntax Error, Unexpected '@' In Php Code

Jun 14, 2011

Parse error: syntax error, unexpected '@' in C:xampphtdocsminippromail.php on line 8 .......its not recognizing the '@' symbol. heres the code im working with

<?php $receiver =; $subject = wish; $content = Hi! My dear friend how are you.; $sender = myself@ ; $headers = From: $sender; mail($receiver,$subject, $content,$headers); echo Mail has been sent successfully.; ?>

View 1 Replies View Related

Programming :: Ar - .libs/libbfd.a - Error Reading Archive.o - File Truncated

May 30, 2010

So the above is the error message I am receiving when trying to compile (at make stage when error received) binutils 2.20.1. I am compiling in Virtualbox and the base machine is SourceMage 64bit.

View 4 Replies View Related

Copyrights 2005-15, All rights reserved