Programming :: Perl Module Installation Fails

Jan 12, 2011

Using perl -MCPAN -e shell then install Mail::Message then yes to everything (except the test that needed an IMAP server) resulted in.

View 3 Replies


ADVERTISEMENT

Programming :: Perl NTLM Authenticating Module

Nov 10, 2010

I'm trying to write a script in Perl to download a file that requires NTLM authentication to access, stored on a machine on this network.The file exists, and can be accessed through a web-browser, btw.

View 1 Replies View Related

Programming :: Socket Programming In Module Perl

Jul 21, 2010

Where is the perl module for programming with sockets?

View 4 Replies View Related

Programming :: Perl Module For Getting Information From Remote Machines

Oct 16, 2010

I need to get some information like cpu usage,free memory,swap memory and other information from a bunch of remote hosts.Can any one tell me of a good perl module which does that.I dont want to use Net::Rsh or Net:SSH.

View 14 Replies View Related

Fedora Installation :: How To Install Perl Module At AWS?

Mar 15, 2010

I need to install the Perl DBI and DBI::mysql modules at Amazon Web Services. Perl 5.8.8 is installed there as part of the default Fedora linux that comes with an EC2 instance. I am not familiar with Fedora, but have been using Linux for a good while.If anyone could tell/show/direct me to the quickest way to do this.

View 1 Replies View Related

Programming :: Perl About System Command / Fails If The Standard Shell Is Dash And Not Bash?

Jun 30, 2011

I am trying to fix a perl script, and I really suck at perl. But I think this problem will be easy for people who know it.

The problem is, I have an old setup script someone wrote many years ago. It fails if the standard shell is dash and not bash. The only way I've gotten it to work is to point /bin/sh to bash. I looked thru the script and it uses "system" many places, and I think that's the problem.

I searched for it and found this link:url

My plan is to include this function:

Code:
sub system_bash {
my @args = ( "bash", "-c", shift );
system(@args);
}
Then I could simply change all calls to system into system_bash and it should work?

The parameter to the system calls is usually some variable. What if the parameter is a list already? Do I need to test for it somehow, and if it's a list, prepend "bash" and "-c" to the list? How do I do that?

In the script there are lots of places like this:

my $error = system($cmd);
if ($error) {
die/warn "some error message";
}

Shouldn't there be a return in the system_bash function?

View 8 Replies View Related

Software :: Perl Module Installation In Custom Location Using Cpanplus

May 19, 2011

I have installed perl5.12.3 in a custom location, ( a NFS share). I have all the libraries created in the same location. This was an attempt not to disturb existing version of perl. I have succeeded doing this.Now, I need to install around 200 perl modules. I tried Bundle option in CPAN shell, it somehow did not work. Does anyone here know off any other better method of installing multiple perl modules. How do I use CPANPLUS to install all the modules. What changes do I make to Config.pm considering custom location of perl installation I have done.

View 1 Replies View Related

Ubuntu Installation :: X Pircture Fails After Nvidia-module Is Enable?

Mar 16, 2010

i've got really wierd problem with kernel 2.6.31-20. After kernel update nvidia-module crashes "picture" on gnome & kde, it gives random colors / pixels to the screen. U can use it, so it's somehow working. Without nvidia module everything work perfectly. I've tried 5 different drivers but no solution. Also reconfigured X (dpkg-reconfigure xserver-xorg).This problem is also with older kernels. Problem came after i rebooted to 2.6.31-20 kernel.

View 1 Replies View Related

Ubuntu :: How To Use Perl Module?

Jul 3, 2011

How do I use a perl module? Am I suppose to call it from the terminal?

View 2 Replies View Related

General :: Not Able To Install Bugzilla Module In Perl

Jul 21, 2011

I am using RHEL5 64 bit. I am trying to install bugzilla. While installing i am getting error.

View 2 Replies View Related

Red Hat :: Installing Perl (v5.8.8) Module For Connecting To MySQL

Aug 2, 2010

I want to connect to MySQL Database installed on RHEL 5 using perl v 5.8.8.The available DBD perl drivers installed on my machine are:DBM, ExampleP, File, Pg, Proxy, Sponge..I downloaded DBD-mysql-2.1012 and tried installing DBD again but got the following error:Can't exec "mysql_config": No such file or directory at Makefile.PL line 167.readline() on closed filehandle PIPE at Makefile.PL line 169.On searching I found that I need to install libz-devel prior to installing driver for MySQL for Perl.

View 1 Replies View Related

Ubuntu :: Using Perl Module To Retrieve Data From IPod

Apr 29, 2010

I am trying to make use of the perl module WWW::Nike::NikePlus to retrieve the data from my ipod but apparently I have no idea what I am doing. I installed the package just as the readme said including all the dependencies. I cant really figure out how to run it, i searched for how to use it and found this : Example use that retrieves and prints your last run information

use WWW::Nike::NikePlus;
my $username = 'my@email.address';
my $password = 'MySecretPassword';
my $locale = "en_us";
my $pin = nike_authenticate( $username, $password, $locale );
unless( $pin ) { print "Authentication failed
"; } .....

#Details of the last run
my ($unit, $last_run_dist, $last_run_duration_millisecs,
$last_run_duration_friendly, $last_run_pace_friendly) = nike_last_run();
print "Last run: $last_run_dist$unit in $last_run_duration_friendly
";
print "Last run pace: $last_run_pace_friendly per $unit
";

So I put it in a txt file and saved it with the extension .pl and of course I put in all my info in the username password fields then made it executable with the command sudo chmod +x nikeplus.pl and when I try to run it with either ./ or perl I get this output:

brandon@desktop:~/Apps/nikeplus$ ./nikeplus.pl
./nikeplus.pl: line 1: use: command not found
./nikeplus.pl: line 2: my: command not found
./nikeplus.pl: line 3: my: command not found
./nikeplus.pl: line 4: my: command not found
./nikeplus.pl: line 6: syntax error near unexpected token `('
./nikeplus.pl: line 6: ` my $pin = nike_authenticate( $username, $password, $locale );'
brandon@desktop:~/Apps/nikeplus$ perl nikeplus.pl
Use of uninitialized value $ENV{"TEMP"} in concatenation (.) or string at /usr/local/share/perl/5.10.0/WWW/Nike/NikePlus.pm line 10.
Use of uninitialized value $last_run_duration_millisecs in division (/) at /usr/local/share/perl/5.10.0/WWW/Nike/NikePlus.pm line 106.
Use of uninitialized value $last_run_dist in division (/) at /usr/local/share/perl/5.10.0/WWW/Nike/NikePlus.pm line 107.
Use of uninitialized value $last_run_duration_millisecs in division (/) at /usr/local/share/perl/5.10.0/WWW/Nike/NikePlus.pm line 107.
Illegal division by zero at /usr/local/share/perl/5.10.0/WWW/Nike/NikePlus.pm line 107.
brandon@desktop:~/Apps/nikeplus$

View 2 Replies View Related

Ubuntu Servers :: 10.04 - ERROR: Module Perl Does Not Exist

Jun 14, 2010

I have Apache/2.2.14 (Ubuntu) DAV/2 SVN/1.6.6 mod_fcgid/2.3.4 Phusion_Passenger/2.2.14 PHP/5.2.10-2ubuntu6 with Suhosin-Patch configured In UBUNTU 10.04 I like to install apache2 mod_perl I make apt-get install libapache2-mod-perl2 and I get: Quote: libapache2-mod-perl2 is already the newest version.

Ok I try sudo a2enmod mod_perl ERROR: Module perl does not exist! how I make Perl work in apache2 UBuntu 10.04

View 3 Replies View Related

Software :: Attempting To Installing Perl Module Gimp::Fu?

Oct 29, 2010

I'm attempting to set up a GIMP scripts for batch operations on groups of image files. Initially I started reading about the Script-Fu syntax but it looked too convoluted (at least for me, with 15 years of Perl experience at work) in a way it does the simpliest of things so I attempted to use Perl instead of Script-Fu. From reading the docs I see that I need to install "Gimp::Fu" Perl module. I installed "cpan" first, started it and issued the command:

install "Gimp::Fu"

and got a dependency problem:

Code:

cpan[1]> install "Gimp::Fu"
CPAN: Storable loaded ok (v2.18)
Going to read /root/.cpan/Metadata
Database was generated on Thu, 28 Oct 2010 17:30:45 GMT

[code]....

View 3 Replies View Related

Server :: Install Different Version Of Perl+module Without Affecting The Existing One ?

May 10, 2011

I need to install different version of Perl with needed modules to Test Run a perl script (ASSP) without affecting the existing one as the old version of Perl is buggy with seg fault.

View 5 Replies View Related

Software :: Getting Bugzilla Setup On RedHat - Perl Install-module.pl DBD - Mysql ?

Apr 12, 2010

I am having some issues getting Bugzilla setup, I have the software on the server and am trying to get the pre-rec's setup.

I am using RedHat 4.1.2-42.

I have all of the required perl modules save one:DBD::mysql

When I try:

I get the following response(this is only an excerpt):

Can't test without successful make Running make install make had returned bad status, install seems impossible.

View 14 Replies View Related

Software :: Yum Fails With Perl Syntax Error

Mar 5, 2010

I have a CentOS 5.4 box running usermin/virtualmin and have been keeping it up to date. Recently all the updates have started failing because yum is broken somehow. Even if I just try to get a version or something here is the response I get from the command line:

# yum -v
Traceback (most recent call last):
File "/usr/bin/yum", line 4, in ?
import yum

[Code]....

I have seen a lot online about problems with yum suggesting "yum clean all" as a fix - but I can't get yum to even start so, of course, that is not an option. I have done nothing manually to this box - the last update must have caused this issue. I also dunno much about perl but I see no problem with the line:

require './apache-lib.pl';

View 5 Replies View Related

Ubuntu :: Upstart Fails To Start A Perl Script?

Jan 22, 2011

On Maverick + up-to-date on updates on Mini ITX (Asus AT3N7A-I) I have a Perl script that I want to run continually to extract values from XML that appears on a USB port every 5 seconds and stuff the extracted values into an RR Database (RRD). I have created an Upstart job, called currentCost.conf (permissions=644 owner=root): #readCurrentCostData4RRD.pl daemon

description "regular background program processing daemon"

start on runlevel [5]
stop on runlevel [!5]
expect fork
respawn
exec perl /home/greg/currentCost/readCurrentCostData4RRD.pl > /tmp/RCCD4RRD.out 2>&1

[Code]...

View 2 Replies View Related

Programming :: Load Fortran Module For Matio Libraries Using Gfortran - Can't Open Module File 'matio.mod' For Reading

Jun 27, 2010

I am interested in using fortran and an external library called matio used to save arrays to matlab .mat files. I have installed the matio and matio-dev packages from synaptics but i cannot compile a code receiving an error Code: christos@christos-laptop:~/Desktop$ gfortran -o test test.f90 -lmatio -lz test.f90:2.13: USE MATIO 1

Fatal Error: Can't open module file 'matio.mod' for reading at (1): No such file or directory How can i load a module in order to use it in fortran through the GCC compiler?

View 1 Replies View Related

General :: Openssl Add-on Module Fails?

Aug 10, 2011

I am a new administrator and am running SLES 11 on a VM. I have openssl installed, but when I attempt to compile an add-on module to Nginx I get the following list of errors:

[Code]...

View 3 Replies View Related

Ubuntu Multimedia :: Installing Webcamstudio Module Fails

Jan 6, 2011

When trying to compile the webcamstudio modulae (ws4gl.org) it doesn't give an error, but when I want to modprobe it....

Code:

This is from dmesg:

Code:

View 1 Replies View Related

Slackware :: VirtualBox < 3.1.4 Module Build Fails On 2.6.33 Kernel

Mar 4, 2010

I had an issue with the module build for vbox 3.1.2 breaking on the latest kernel ( /etc/rc.d/rc.vboxdrv setup ). Apparently the issue is that a kernel header (autoconf.h ) has changed its location in the module tree and hence the issue.

2 options:

1. upgrade to 3.1.4

2. create a symlink as follows

cd /usr/src/linux/include/linux
ln -s ../generated/autoconf.h autoconf.h

View 12 Replies View Related

Slackware :: X Fails To Start After Upgrade - Invalid Module

Mar 6, 2010

So I made the upgrade to slackware64-current and all of a sudden after my next reboot, startx failed, and x refused to start the output was the following:

Code:
Release Date: 2010-02-16
X Protocol Version 11, Revision 0
Build Operating System: Slackware 13.1 Slackware Linux Project
Current Operating System: Linux hd830 2.6.33 #3 SMP Sat Feb 27 19:42:32 CST 2010 x86_64
Kernel command line: BOOT_IMAGE=Linux ro root=803 vt.default_utf8=0
Build Date: 23 February 2010 12:09:32PM

Current version of pixman: 0.16.6
Before reporting problems, check http://wiki.x.org
to make sure that you have the latest version.
Markers: (--) probed, (**) from config file, (==) default setting,
(++) from command line, (!!) notice, (II) informational,
(WW) warning, (EE) error, (NI) not implemented, (??) unknown.
(==) Log file: "/var/log/Xorg.0.log", Time: Sat Mar 6 19:21:18 2010
(==) Using default built-in configuration (30 lines)
(EE) Failed to load module "fbdev" (module does not exist, 0)
WARNING: Error inserting button (/lib/modules/2.6.33/kernel/drivers/acpi/button.ko): Invalid module format
WARNING: Error inserting i2c_algo_bit (/lib/modules/2.6.33/kernel/drivers/i2c/algos/i2c-algo-bit.ko): Invalid module format
WARNING: Error inserting agpgart (/lib/modules/2.6.33/kernel/drivers/char/agp/agpgart.ko): Invalid module format
WARNING: Error inserting drm (/lib/modules/2.6.33/kernel/drivers/gpu/drm/drm.ko): Invalid module format
WARNING: Error inserting drm_kms_helper (/lib/modules/2.6.33/kernel/drivers/gpu/drm/drm_kms_helper.ko): Invalid module format

FATAL: Error inserting i915 (/lib/modules/2.6.33/kernel/drivers/gpu/drm/i915/i915.ko): Invalid module format
(EE) intel(0): No kernel modesetting driver detected.
(EE) Screen(s) found, but none have a usable configuration.
Fatal server error:
no screens found

Please consult the The X.Org Foundation support. Please also check the log file at "/var/log/Xorg.0.log" for additional information. So then after some googling I got the suggestion to downgrade udev-151 to udev-141, but that yeilded no results. So I did some more googling and a bunch of people who had the same problem said that downgrading module-init-tools worked, so I downgraded from module-init-tools 3.11 something to 3.6 and now, not only does my X no longer work, but no modules are being loaded I believe, for example I saw in my startup that fuse was not being loaded, ndiswrapper which I had installed was not loaded.

View 7 Replies View Related

CentOS 5 :: Yum Fails With 'module' Object Has No Attribute 'main'

May 5, 2009

Any attempt to run yum produces the following error:

Traceback (most recent call last):
File "/usr/bin/yum", line 29, in ?
yummain.main(sys.argv[1:])
AttributeError: 'module' object has no attribute 'main'

It doesn't matter what command line arguments I use I get the same.I've spent a day or so searching on Google but not had any luck in identifying what is causing this problem.

View 4 Replies View Related

Ubuntu :: Perl Modules Using CPAN - Get The Message From CPAN That This Module Is Already Up To Date?

Jun 7, 2010

I tried to use CPAN to install a module Algorithm::Loops using "install Algorithm::Loops". I get the message from CPAN that this module is already up to date.But, when I try to use it I get the message:

Can't locate Algorithm/Loops.pm in @INC (@INC contains: /etc/perl /usr/local/lib/perl/5.10.1 /usr/local/share/perl/5.10.1 /usr/lib/perl5 /usr/share/perl5 /usr/lib/perl/5.10 /usr/share/perl/5.10 /usr/local/lib/site_perl .) at ./test.pl line 4.
BEGIN failed--compilation aborted at ./test.pl line 4.

And indeed, the file Loops.pm is nowhere to be found.Isn't that a contradiction?

View 2 Replies View Related

Fedora :: Vmware 1.0.10 On Core 12 - Fails On Building The Vmmon Module

Jan 25, 2010

I have tried installing Vmware-Server 1.0.10 on Fedora Core 12. After installing all packages it fails on building the vmmon module. In the internet i found many patches and vmware-any-any-updates...but nothing worked. My Kernel Vresion is 2.6.31.12-174.2.3.fc12.i686.PAE...

View 2 Replies View Related

Server :: Php-mysql Dynamic Module Fails On RHEL 5.5 - Undefined Symbol: Executor_globals

Nov 17, 2010

I've recently installed a RedHat Enterprise Linux server and am attempting to get PHP/MySQL installed on it. It cannot load the dynamic php mysql module, giving me an error (in /var/log/error_log) that reads as follows:

PHP Warning: PHP Startup: Unable to load dynamic library '/usr/lib/php/modules/mysql.so' - /usr/lib/php/modules/mysql.so: undefined symbol: executor_globals in Unknown on line 0

(In fact, it fails to load ALL of the dynamic php modules, either with the "undefined symbol: executor_global" or "undefined symbol: core_globals" I DO NOT WANT to compile anything -- I want to stay with stock RedHat released software.

[root@hostname-suppressed httpd]# uname -a
Linux hostname-suppressed 2.6.18-194.17.4.el5PAE #1 SMP Wed Oct 20 13:13:33 EDT 2010 i686 athlon i386 GNU/Linux
[root@hostname-suppressed httpd]# cat /etc/redhat-release
Red Hat Enterprise Linux Server release 5.5 (Tikanga)

[code]....

View 3 Replies View Related

Programming :: Paralel Port Kernel Module Programming

Jan 5, 2011

do you have any code to flash led lights with paralel port (device driver programming)or any lecture about this subject .if there is a working code this would be better ofcourse.

View 1 Replies View Related

CentOS 5 :: Perl CPAN GD Module Failing - Can't Locate Object Method "png" Via Package "GD::Image"

Jun 29, 2010

I have CentOS 5.4 and have installed CPAN GD module.Installation messages seemed clean and successful.When I try to create a png file, perl gives the error message :

Can't locate object method "png" via package "GD::Image" at
/usr/lib/perl5/vendor_perl/5.8.8/DBD/Chart/Plot.pm line 1276 (#1)
(F) You called a method correctly, and it correctly indicated a package
functioning as a class, but that package doesn't define that particular
method, nor does any of its base classes. See perlobj.

Also, the following perl one-liner gives answer "No".

perl -e 'use GD; $im=GD::Image->new(); print $im->can("png") ? "Yes" : "No" , "
";'

I suspect that this GD module requires Image::Magick, but that borks on installation.

Magick.xs:2344: warning: implicit declaration of function ´┐ŻMagickCoreGenesis´┐Ż
make: *** [Magick.o] Error 1
JCRISTY/PerlMagick-6.59.tar.gz

[code]...

View 3 Replies View Related

Programming :: Cannot Install Perl / Tk

May 9, 2010

I just downloaded Tk-804.028 and try to install it (according to the README.linux) but I get:

> perl Makefile.PL
/opt/ActivePerl-5.10/bin/perl-static is installed in /opt/ActivePerl-5.10/lib okay
PPM for perl5.010001
Test Compiling config/perlrx.c
Test Compiling config/pmop.c
Test Compiling config/pregcomp2.c

[code]...

View 5 Replies View Related







Copyrights 2005-15 www.BigResource.com, All rights reserved