OpenSUSE :: 11.3 X86_64 Compile - Not Recognized Configure: Error: /bin/sh ./config.sub X86_64-unknown-linux- Failed

Aug 3, 2010

Attempting to compile an application that is not located in any of the repos yet for 11.3 64 bit. I have downloaded the appropriate src and untarred it. However, when I attempt to run the ./configure command here is the error I receive. checking build system type... Invalid configuration `x86_64-unknown-linux-': machine `x86_64-unknown-linux' not recognized configure: error: /bin/sh ./config.sub x86_64-unknown-linux- failed

I have made sure that I have all kernel-headers packages installed and am unsure as how to proceed. I tried using the command "./configure --build=x86_64" and then receive an error stating that the "SYSTEM IS NOT SUPPORTED" and continued errors stating that gcc is not installed, eve though it is.

View 5 Replies


OpenSUSE :: Error: Failed Dependencies - Doesn't Compile - RPM Won't Install - X86_64

Feb 27, 2010

I tried installing the RPM from tcpflow website. error: Failed dependencies: is needed by tcpflow-0.21-1.i386 I installed libpcap1-32bit, but doesn't help. I tried added soft-link to from to workaround, doesn't help. hen I DLed the tarball, ./configure gives an error, even after including --with-pcap=/usr/lib64/ checking for --with-pcap option... configure: error: /usr/lib64/ does not exist I CAN'T install the rpm, I CAN't compile from source. I can't find this program on any suse repo. I need to use this prog -- what can I do?

View 14 Replies View Related

Fedora :: F11 X86_64 Eduke Compile Error: Failed Linking Executable Eduke32!

Aug 6, 2010

trying to build Eduke32 from source but I receive the following error:


[priit@T16 eduke32]$ make
Build started using "gcc -fomit-frame-pointer -funswitch-loops -O2 -fno-stack-protector -W -Wall -Wimplicit -Werror-implicit-function-declaration -funsigned-char -fno-strict-aliasing -DNO_GCC_BUILTINS -Isource -Ibuild/include -Isource/jmact -Isource/jaudiolib


View 2 Replies View Related

OpenSUSE Install :: Subprocess Failed. Error: RPM Failed: Installing Package Xen-4.0.0_21091_06-0.1.1.x86_64?

Oct 14, 2010

Subprocess failed. Error: RPM failed: installing package xen-4.0.0_21091_06-0.1.1.x86_64 needs 27MB on the /boot filesystemI seem not to be able to change the size of the /boot, but 11.2 loads okay but not 11.3There only 19MB left from 66 and I can't make it bigger, I hope there is someone thathas seen this. I would like to see some of the update with XEN.

View 1 Replies View Related

OpenSUSE :: Error: RPM Failed: Error: Package Kbd-1.14.1-20.2.x86_64 Is Not Installed

Feb 26, 2010

Online Update is offered up 6 updates - only 2 succeeded (Mozilla and libpoppler). Here's the errors for other packages: kbd - Keyboard and Font Utilities (includes aaa_base update) Subprocess failed. Error: RPM failed: error: package kbd-1.14.1-20.2.x86_64 is not installed

php5: fix for several vulnerabilities Subprocess failed. Error: RPM failed: error: package php5-ctype-5.3.0-2.4.3.x86_64 is not installed

patterns-openSUSE: add susehelp to KDE base pattern
Subprocess failed. Error: RPM failed: error: package
patterns-openSUSE-file_server-11.2-20.22.1.x86_64 is not installed
KDE 4.3.5 Update
Subprocess failed. Error: RPM failed: rpmdb: PANIC: Invalid argument
rpmdb: PANIC: fatal region error detected; run recovery


View 6 Replies View Related

Slackware :: [13.1-x86_64] GnuCash Compile Error : Gnome-utils

Jun 23, 2010

error message

mv -f .deps/gnc-icons.Tpo .deps/gnc-icons.Plo
mv -f .deps/gnc-html.Tpo .deps/gnc-html.Plo
make[5]: Leaving directory `/tmp/SBo/gnucash-2.2.9/src/gnome-utils'
make[4]: *** [all-recursive] Error 1
make[4]: Leaving directory `/tmp/SBo/gnucash-2.2.9/src/gnome-utils'
make[3]: *** [all] Error 2


I'm using SBo script to compile gnucash, with all the listed dependencies built successfully (in orderly manner). System multilib is configured as per alien's wiki. Is there something else I'm missing here?

View 9 Replies View Related

Server :: RHEL X86_64 Yum - Error: Certificate Verify Failed

Aug 11, 2010

We installed 3 new rhel 5.5 systems yesterday; each of which are generating this error " Error: certificate verify failed" in response to a basic "yum update". From what I can gather, via a general search, this may be isolated to x86_64 -- however the references I found were specific to Satellite Server (which we are not using). Never the less, I checked the PATHs for the cert and they are correct. All of our 32 bit systems are running RHEL 5.5 and this is not a problem on any of them.

View 6 Replies View Related

Slackware :: How To Compile Gnustep For X86_64

Apr 9, 2010

The background to the problem. I was dangerous, not deadly or elite and I want to be that way again. The best representation that I have found is oolite. Now this installs by auto-package but only in 32-bit and I find auto-package a bit of a pain. I have the windows version installed and running under wine but would prefer a compiled 64-bit Slackware package.

Oolite requires gnu-step so I have downloaded the source and some old (12.2) slackbuilds, which I have modified, and made a package for gnustep-make. The next stage is to make a package for gnustep-base however it is failing with the following error


./configure: line 1390: gnustep-config: command not found
configure: error: cannot run /bin/sh /tmp/SBo/gnustep-base-1.18.0/config.sub

View 14 Replies View Related

General :: Using Firefox 4.01 On GNU/Linux X86_64 \ Autoupdate From 4 To 5?

Jun 22, 2011

I am using Firefox 4.01 on GNU/Linux x86_64. Is there any reason why there is no autoupdate? In fact, when I look at the "About Firefox" dialog, it just says "Updates available at [URL]

View 2 Replies View Related

General :: X11 - Screwed Up Sound?

Aug 24, 2011

I just installed nVidia GT440 w/ driver on my Scientific Linux on two of my workstation and one of workstation sound disappeared. Both workstations are identical though in terms of hardware and OS (Scientific Linux).

I'm not really sure where to look, but here is dmesg from workstation where sound isn't working:[URL]..whenever I go to System -> Preference -> Sound -> Output on broken workstation I only see "HDA NVidia Digital Stereo (HDMI)" and my old/onboard sound card is missing.

I actually did roll out of same Video Card to more then just 2 workstation, I did that to a 5. Only 2 of them sound working as expected. 1 of them didn't even needed to install nVidia drivers but that workstation running slightly newer OS version 6.1 instead of rest 6.0, so I'm back to where I started it ... clueless ;(

View 1 Replies View Related

Red Hat / Fedora :: Error: Failed Dependencies - Glibc = 2.12.1-3 Is Needed By Glibc-common-2.12.1-3.x86_64

Oct 26, 2010

I've been working to get gcc up and running on a new install of Fedora 13. glibc-devel had dependencies upon installation where it required glibc and glibc-common, both 2.12.1-3. No problem, found both at rpm dot pbone dot net. However, when I try to install the following circular dependency results... it doesn't matter the order of install.


[root AT localhost gcc_install]# rpm -ivh glibc-common-2.12.1-3.x86_64 .rpm
error: Failed dependencies:
glibc = 2.12.1-3 is needed by glibc-common-2.12.1-3.x86_64


View 5 Replies View Related

Server :: Error: Failed To Retrieve Repodata/filelists.xml.gz From Rhel-x86_64-server-5

May 24, 2010

I am getting these error in RHEL 5.3 while i did "yum update".

---> Package libstdc++-devel.i386 0:4.1.2-46.el5_4.2 set to be updated
---> Package libstdc++-devel.x86_64 0:4.1.2-46.el5_4.2 set to be updated
---> Package libstdc++44-devel.i386 0:4.4.0-6.el5 set to be updated


The program package-cleanup is found in the yum-utils package.

View 2 Replies View Related

OpenSUSE :: Updater Error Libqoauth1.x86_64 Conflict?

Oct 27, 2010

I keep getting this error. packageKit Error dep-resolution-failed: patch:choqok-3320.noarch conflicts with libqoauth1.x86_64 When I go to the YAST software manager and search for libqoauth1.x86_64 it doesn't hit on anything. What gives here?

View 9 Replies View Related

Fedora X86/64bit :: Compile 32 Bit Application On X86_64 FC11

Sep 28, 2009

I need to develop application for 32 bit environment.

Before to install FC11 64, I used FC 9 and FC 10 i386 version without any issues.

I'm lookking for a tutorial about use 32 bit development environment in a 64 bit OS.

How or where I can setup FC11 for this features.

View 2 Replies View Related

OpenSUSE Install :: Compiling Libeio On 11.4 X86_64 - Error: 'SYNC_FILE_RANGE_WAIT_BEFORE' Undeclared (first Use In This Function)

May 29, 2011

I've trouble compiling libeio on my openSUSE 11.4 x86_64:


View 9 Replies View Related

General :: Lame Compile - Failed Running ./configure - Error

Aug 1, 2010

I tried to install lame on Linux, but I failed running ./configure.

View 9 Replies View Related

Fedora :: Heartbeat Failure [rc=1]. Failed On 14 X86_64?

Nov 19, 2010

after i installed F14 on my box, I'll receive this error on boot log message: Code:Heartbeat not configured: /etc/ha.d/ not found.Heartbeat failure [rc=1]. can i fix it?

View 1 Replies View Related

Fedora X86/64bit :: 15 X86_64 Failed To Start?

Jul 27, 2011

I can not start fedora 15 because i take this message:HTML Code:Starting udev wait for complete device initialization failed, see ' system ctl status udev-settle.service for details

View 2 Replies View Related

Server :: Ethernet Driver Not Detected In SUSE Linux Server 10.2 SP2 (x86_64)?

Nov 13, 2010

i had installed open suse linux enterprise server 10.2 SP2 (x86_64) i successfully installed the operating system with adding more packages, but after going inside i cannot configure ethernet, though i have 2 ethernet ports, no ports has been found, i installed some drivers but i cannot found the ethernet , while giving command ifconfig i get this ,

lo Link encap:Local Loopback
inet addr: Mask:


how i need to detect the ethernet card i updated more packages and configured network card but not connected...

View 2 Replies View Related

General :: [B][RED]Critical - Error Yum Install Nagios-plugins.x86_64 Yum Error Unsatisfied Dependency

Oct 7, 2010

i need to install nagios-plugins 64 bit, when i tried to install via yum i got this error yum install nagios-plugins.x86_64 yum error Unsatisfied dependency i hv installed openssl 32 bit but it needs openssl 64 bit, even php and perl. i tried to to install via yum yum install openssl.x84_64 but its not getting installed i tried to uninstall openssl but its shows so many packages to remove

View 4 Replies View Related

Fedora X86/64bit :: ERROR - X86_64 Error: 37: No Locks Available

Aug 10, 2011

I am getting the below Issue while cloning Oracle Database Server from cold Backup dump. its happening during "perl appsTier". Can anyone help on this issue..? find the error details below.

SQL*Plus: Release - Production on Sat Aug 6 12:10:08 2011 Copyright (c) 1982, 2010, Oracle. All Rights Reserved.


View 2 Replies View Related

Fedora Installation :: ERROR: Your Architecture, 'x86_64', Is Not Supported By The

May 10, 2009

I have downloaded Fedora 11 x64, and I went to the adobe website and downloaded the tar.gz file for flash player. I went into the terminal to untar the file and after I did that I tried to install it and got this error :

ERROR: Your architecture, 'x86_64', is not supported by the Adobe Flash Player installer. What does this mean? My dad could get his to install but his is 32 bit.Do I have to wait until the full version is out?

View 8 Replies View Related

CentOS 5 :: Fatal Error Causes 5.4 X86_64 Install To Abort

Nov 13, 2009

While attempting to install CentOS 5.4 x86_64 from DVD (downloaded torrent), I encountered a fatal error that aborted the install and dumped a bunch of log files. I attempted this a couple of times resulting in the same error. I tested my hardware via CentOS 5.4 x86_64 live cd without exception. Here is my install configuration:

1)Booted to DVD
2)Skipped media test
3)English (English)
4)U.S. English


View 8 Replies View Related

OpenSUSE :: Track Down An Rpm For 11.2 X86_64

Feb 10, 2010

I just tried to install mythvideo 0.22 from the packman repository and Yast tell me it requires python-imdb. Havent been able to track down an rpm for opensuse 11.2 x86_64. Is there any way to request that this rpm be built?

View 2 Replies View Related

Fedora :: Error: Package Libobasis3.3-extension-pdf-import-3.3.1-8.x86_64.rpm Is Not Signed

Mar 21, 2011

When I tried to install LibreOffice 3.3_64 on my Fedora14_64 I received the following error:

Package libobasis3.3-extension-pdf-import-3.3.1-8.x86_64.rpm is not signed Has anyone run into this? Is there a way to fix this?

View 2 Replies View Related

OpenSUSE :: Install Gnome-mplayer On 11.2 X86_64

Jul 2, 2010

I can't install gnome-mplayer on my openSUSE 11.2 I used the " 1-click insall" I also tried manully installation, got below errors # rpm -ivh gnome-mplayer- gnome-mplayer-lang- error: Failed dependencies: MPlayer is needed by gnome-mplayer- is needed by gnome-mplayer-

View 4 Replies View Related

OpenSUSE :: Lm_sensors Do Not Show CPU Temperature (11.3 X86_64)

Aug 3, 2010

I have a problem with monitoring CPU temperature on x86_64 OpenSUSE 11.3. It returns the following:

Adapter: ISA adapter
in0: +1.18 V (min = +0.00 V, max = +4.08 V)
in1: +1.58 V (min = +0.00 V, max = +4.08 V)


I use a Core i5 750 on a Gigabyte GA-P55A-UD3 motherboard. I could not find anything useful neither by googling, nor by using the forum search.

View 1 Replies View Related

OpenSUSE :: Using Amarok-2.3.1-32.1.x86_64 - Unable To Get Sound

Sep 29, 2010

I am using amarok-2.3.1-32.1.x86_64 kde45 repo 11.3 Tried OSS version too All other audio functions. Using Clementine ATM which is great.

View 4 Replies View Related

OpenSUSE :: 11.3 X86_64 Openoffice Impress - Pps No Sound

Dec 16, 2010

I had a opensuse 11.1 X86_64 system with openoffice. This has been replaced by an opensuse 11.3 X86_64 system with openoffice I have many pps files and these worked complete with sound on the 11.1 system but there is no sound on the 11.3 system. The 11.1 system has gone and was overwritten by Windows 7 so I can't verify the build. I know I made lots of changes to the 11.1 system in order to fix various problems and openoffice could well have come from a factory repo.

What I need to know is what is needed to make impress play pps presentations as it did on 11.1 and does on windows 7. I searched on the internet and it appears that the novell version of ooo may use gstreamer. I have loaded many gstreamer packages from packman including plugin-good but still get no sound. Starting impress from a command line does not produce any error messages.Does the novell openoffice use gstreamer or java multimedia? I have not yet tried the java option I could try downloading the novell openoffice source and try to work out what it is using. I am not sure that I have the time to go searching through the source and probably trying to compare it to the ooo source

View 9 Replies View Related

OpenSUSE :: Lvm2-clvm Will Not Install On 11.3 X86_64

Jan 4, 2011

Running 'zypper install lvm2-clvm' results in a message: Resolving package dependencies... Problem: nothing provides needed by lvm2-clvm-2.02.45-16.2.x86_64 Solution 1: do not install lvm2-clvm-2.02.45-16.2.x86_64 Solution 2: break lvm2-clvm by ignoring some of its dependencies So it cannot find the cpg library, which appears to be a part of openais (if I believe google). I have configured the following repositories:


What could be the problem here? Am I just missing a repository or is cluster LVM not supported on opensuse 11.3?

View 9 Replies View Related

Copyrights 2005-15, All rights reserved