General :: Getting Error : Make: *** /lib/modules/2.6.31-20-generic/build: No Such File Or Directory On 9.1?

May 9, 2010

When trying to install my WiFi card's driver on Ubuntu 9.1, I run the make command and get the following error:make: *** /lib/modules/2.6.31-20-generic/build: No such file or directory

View 1 Replies


ADVERTISEMENT

OpenSUSE :: Error:make: *** /lib/modules/2.6.31.5-0.1-desktop/build: No Such File Or Directory?

Oct 6, 2010

I've downloaded a linux driver for my wireless card (Realtek 8191SE), and whenever I try to make it it gives me the following error:make: *** /lib/modules/2.6.31.5-0.1-desktop/build: No such file or directory. Stop.
make: *** [all] Error 2I have installed make, pattern devel_basis devel_C_C++, kernel-source, linux-kernel-headers, gcc43, etc.I also tried linking them:# ln -s /usr/src/kernel-headers-2.6.31.5-0.1-desktop /lib/modules/2.6.31.5-0.1-desktop/buildln: creating symbolic link `./build': File existslinux-ynct:/lib/modules # ls2.6.31.14-0.1-debug 2.6.31.14-0.1-desktop 2.6.31.5-0.1-desktop2.6.31.14-0.1-default 2.6.31.14-0.1-xen

View 9 Replies View Related

Ubuntu Installation :: Boot Error "modprobe: FATAL Could Not Load /lib/modules 2.6.35-22 Generic Modules No Such File Or Directory"

Apr 14, 2011

Tonight I installed ubuntu 10.10 (32 bit) on an external usb harddrive with a dvd I burned and I used my older desktop. I disconnected all internal and external drives first so everything had to be put on the usb drive I selected (only option available). I used the option to load extra software, use the entire hard drive, and let the software do it's thing. I basically had no options where to put things and it didn't have much choice.

When I boot the usb drive on my laptop (win 7 64 bit) by telling the bios to boot to it first... I get an error: modprobe: FATAL Could not load /lib/modules 2.6.35-22 generic modules No such file or directory. This message appears twice and then it does boot into ubuntu and seems to work fine. I'm new to this OS so that is an uneducated guess but the things I have done seem to be working. So exactly what is this error referring too? Is there a way to fix the problem or do I just ignore it.

View 9 Replies View Related

OpenSUSE :: Make: *** /lib/modules/2.6.31.5-0.1-desktop/build: No Such File Or Directory

Feb 17, 2010

I'm attempting to install a WLAN card driver from source, as that's all that's available.I'm getting:

make: *** /lib/modules/2.6.31.5-0.1-desktop/build: No such file or directory

Build appears to be a link pointing to "/usr/src/linux-2.6.31.5-0.1-obj/x86_64/desktop"."linux-2.6.31.5-0.1-obj" doesn't exist.

View 4 Replies View Related

Software :: Make: *** /lib/modules/2.6.32-71.el6.x86_64/build: No Such File Or Directory

Mar 22, 2011

I then went agead to download ethernet realtek ethernet gigabyte card driver for my version of linux. I untar the file and i got the directory r8168-x.x.xxx.xx, a README file so i read the README file and it asked me to run ./autorun.sh which i did but i got the following error:

Check old driver and unload it.
Build the module and install
make: *** /lib/modules/2.6.32-71.el6.x86_64/build: No such file or directory. Stop.

[code]....

View 4 Replies View Related

OpenSUSE :: /lib/modules/2.6.34-12-desktop/build: No Such File Or Directory - Stop - Error

Mar 17, 2011

I am trying to install an application. But when I do a make it gives me this error . I tried to resolve it by installing kernel-sorce, kernel-devel packages But still cant seem to get rid of the error.

View 3 Replies View Related

General :: FATAL: Could Not Load /lib/modules/2.6.18-194.17.1.el5.028stab070.7PAE/modules.dep: No Such File Or Directory

Mar 6, 2011

I want set up VPN on my VPS but when i try to turn on tun/tap i see:

:/lib/modules# modprobe tun
FATAL: Could not load /lib/modules/2.6.18-194.17.1.el5.028stab070.7PAE/modules.dep: No such file or directory
os : debian 5
(folder lib/modules is empty)

View 1 Replies View Related

General :: 6.13 GMP-5.0.0 LFS Make Error - Cannot Open Shared Object File: No Such File Or Directory

Jun 10, 2010

I'm currently stuck at 6.13 GMP-5.0.0 of the LFS installation. After running make, I receive the following:

error while loading shared libraries: libbfd-2.20.so: cannot open shared object file: No such file or directory
make[2]: *** [libmpn.la] Error 127
make[2]: Leaving directory `/sources/gmp-5.0.0/mpn'

[code]....

View 5 Replies View Related

Ubuntu :: Error Inserting Uinput (/lib/modules/2.6.32-22-generic/kernel/drivers/input

May 15, 2010

I am trying to use my Wiimote with ubuntu. I have followed the guide on here:[URL].. But I get this error when I run modprobe:

FATAL: Error inserting uinput (/lib/modules/2.6.32-22-generic/kernel/drivers/input/misc/uinput.ko): Operation not permitted

View 2 Replies View Related

OpenSUSE Install :: Install Some Wireless Drivers - Don't Have A /lib/modules/<kernel>/build Directory

Dec 14, 2009

I'm trying to install some wireless drivers, but apparently I don't have a /lib/modules/<kernel>/build directory, which is causing the Makefile to throw an error. Is there a specific place I should point the Makefile at?

View 9 Replies View Related

General :: Use Mkdir Command To Create 'local' Directory In /usr - There Are Error - Cannot Make Directory

Jun 16, 2010

I am a student studying computer science course.

Well, I am facing problem when doing lab questions.

I must use DLXLinux bundled in Bochs (bochs.sourceforge.net).

I am required to use the /usr/local directory.

In /usr directory, there is no directory named 'local' but there is one thing called 'local@'. So, when I try to use mkdir command to create 'local' directory in /usr , there are error "cannot make directory.....".

Look at my screenshot at [url].

View 9 Replies View Related

General :: Can't Build RRDTool On RHEL4 - 'make' Command Give Error Message

Mar 19, 2010

I'm new to LinuxQuestions and this is my first post. I'm trying to build rrdtool to install Cacti and encountered the following problem: 'make' step returns an error messages:

Code:
./.libs/librrd.so: undefined reference to `xmlTextReaderGetParserLineNumber'
collect2: ld returned 1 exit status
What I have doneDownload and build the latest version of pkg-config, glib, pixman, cairo, pango, atk, gtk+ from official sites.
Download rrdtool source
Set PKG_CONFIG_PATH correctly

[Code]...

There is actually another problem with the computer which is "The Nautilus application has quit unexpectedly" everytime I open File Browser application or right-click>Properties a file/directory. This happen only after installing cairo and pango and I don't know how to revert to old version. Since there are a lot of log files so I'm very confused. Can someone give me a direction on how to resolve this?

View 3 Replies View Related

Fedora :: Doubt In Syntax Of A Generic Make File?

Sep 15, 2010

I was learning to write a make file, I could understand most part of it of course with few exception I dint understand what does the below commands make(red font). I would like to understand what those syntax represent rather than mugging up without knowing what it means.

$(OBJECTS) :%.o :%.c
$(CC) -c $(CFLAGS) $(INCLUDES) $< -o $@

clean:

rm -f *.o $(TARGET) core

View 1 Replies View Related

Debian :: When Try To Make A Directory Or Upload A File It Returns An Error Saying That Permission Is Denied?

Apr 9, 2010

I ftp into the server and see the files, but when i try to make a directory or upload a file it returns an error saying that permission is denied.I am wanting the users to be able to log on with their user account and then be able to have full control over their directories. What can i do to fix this problem?I have enabled port forwarding for ftp. What else is there i can do? If you need any extra information, let me know! I would like to get this fixed asap!Here is my vsftpd.conf file.

# Example config file /etc/vsftpd.conf
#
# The default compiled in settings are fairly paranoid. This sample file

[code]....

View 4 Replies View Related

General :: Unable To Build Python Modules In Mandriva 2010?

Jan 14, 2010

I am trying to build a Python module (pyfits) but I get the following error:

# python setup.py install
/home/steve/src/pyfits-2.2.2/stsci_distutils_hack.py:239: DeprecationWarning: os.popen3 is deprecated. Use the subprocess module.

[code]....

View 2 Replies View Related

General :: Kernel 3.0-ARCH VMWare Modules Wont Build

Aug 4, 2011

Since new kernel 3.0 update I cannot rebuild vmware modules

Quote:

sudo vmware-modconfig --console --install-all Unable to initialize kernel module configuration

how to do that. Where do I insert the "CONFIG_LOCALVERSION" line.

Quote:

Same here. This seems to be due to the kernel version being "3.0" instead of "3.0.0". Recompiling the Kernel (and all modules based on it, e.g. nvidia) with
CONFIG_LOCALVERSION=".0-ARCH" allows me to compile the modules and run VMware.

View 4 Replies View Related

Fedora Installation :: Error - "Your System Does Not Seem To Be Set Up To Build Kernel Modules"

Dec 27, 2009

I'm trying to install Sun VirtualBox Additions into Fedora 12 which is installed in VirtualBox running on top of Windows 7. As the Fedora install was originally a live distro which was then installed to the HD, it may be missing some essential files for compiling.

My attempt to install the VBoxLinux additions is incomplete and I can't get the full range of video displays. The largest is This is the error message: "Your system does not seem to be set up to build kernel modules".

Should I update Fedora to install all the updates available? I did find one webpage which gave an accurate list of files to install for this purpose but can't find it now.

View 3 Replies View Related

General :: 'make Menuconfig' To Make These Files Modules Rather Than Compiled Elements?

Feb 25, 2011

I need to modify fs/open.c and fs/read_write.c to make my modifications. I cannot find any options in 'make menuconfig' to make these files modules rather than compiled elements. I'm thinking these cannot be modules because the file system won't work without open.c and read_write.c. Is this correct - I cannot compile fs/open.c and fs/read_write.c as modules, only as compiled elements? Or, is there some way for a module to overwrite these routines when the module is installed and re-enable the routines when the module is removed?

View 3 Replies View Related

Software :: Build File Or Folder Missing In Modules Folder

Apr 14, 2009

i am trying to install a driver for my belkin wireless usb adapter but when i type make it says cannot find lib/modules/<debian version>/build so it does not configure the sources.

View 1 Replies View Related

Programming :: Makefile Error - No Rule To Make Target Modules

Mar 30, 2010

Code:
anisha@linux-p0mg:~> uname -r && cat /etc/*release
2.6.25.5-1.1-pae
openSUSE 11.0 (i586)
VERSION = 11.0
My small Makefile:

Code:
obj-m += serialPortISR.o
all:
make -C /lib/modules/$(shell uname -r)/build M=$(PWD) modules
clean:
make -C /lib/modules/$(shell uname -r)/build M=$(PWD) clean
Errors I receive:

Code:
anisha@linux-p0mg:~/Desktop/serialPortISR_31_10_09> make
make -C /lib/modules/2.6.25.5-1.1-pae/build M=/home/anisha/Desktop/serialPortISR_31_10_09 modules
make[1]: Entering directory '/usr/src/linux-2.6.25.5-1.1-obj/i386/pae'
make[1]: *** No rule to make target `modules'. Stop.
make[1]: Leaving directory '/usr/src/linux-2.6.25.5-1.1-obj/i386/pae'
make: *** [all] Error 2

View 12 Replies View Related

CentOS 5 :: No Support For /proc/modules - No Such File Or Directory /sbin/modprobe -l?

May 19, 2009

i'm using Centos 5.3 (2.6.27.10-grsec-xxxx-grs-ipv4-64 x86_64 kernel) and i got a problem with installing apf/configuring iptables. It seems that my kernel doesn't support Loadeble Kernel Modules. I'm receiving following message when catting /proc/modules: Quote: cat: /proc/modules: No such file or directory /sbin/modprobe -l FATAL: Could not load /lib/modules/2.6.27.10-grsec-xxxx-grs-ipv4-64/modules.dep: No such file or directory

View 4 Replies View Related

General :: Make A File/directory Transparent When It Is 'cut'?

Feb 6, 2010

I'm using ubuntu 9.10. I was wondering if it is possible to make a file/directory transparent when it is 'cut', like it is in Windows.

View 14 Replies View Related

OpenSUSE Network :: Installing Driver Error - No Rule To Make Target `modules' - Stop

Apr 13, 2011

I am relatively new to linux and am running into a problem. I just got a new laptop and need to configure/install it's wireless driver but am getting an error when running "make". The error is: make[1]: Entering directory `/lib/modules/2.6.37.1-1.2-desktop/build' make[1]: *** No rule to make target `modules'. Stop.

I have scoured these forums and know that others have the same issue (when configuring other drivers/programs). I am sorry if this post is redundant. It sounds like the Makefile is pointing to the wrong directory. I am using opensuse 11.4, have make and gcc installed. My kernel is linux-2.6.37.1-1.2 (I just re-installed the desktop kernel to make sure it was up to date). The driver I am trying to install is located here: AUR (en) - rtl8192ce.

Another forum suggests pointing somewhere in the /usr/src/linux-2.6.37.1-1.2 directory instead. Is this correct? Should I be pointing to a folder within this? I am not a programmer but any description about what I am actually putting in this directory and why would be awesome (so I can learn a bit more). Or just helping me solve the problem would be great too.

View 9 Replies View Related

General :: Make New File Permission Inherit From The Parent Directory?

Jun 12, 2010

I have a directory called data. Then I am running a script under the user id 'robot'. robot writes to the data directory and update files inside. The idea is data is open for both me and robot to update.

So I setup the permission and owner group like this

drwxrwxr-x 2 me robot-grp 4096 Jun 11 20:50 data

where both me and robot belongs to the 'robot-grp'. I change the permission and the owner group recursively like the parent directory.

I regularly upload new files into the data directory using rsync. Unfortunately, new files uploaded does not inherit the parent directory's permission as I hope. Instead it looks like this

-rw-r--r-- 1 me users 6 Jun 11 20:50 new-file.txt

When robot tries to update new-file.txt, it fails due to lack of file permission.

I'm not sure if setting umask helps. In anycase the new files does not really follow it.

$ umask -S
u=rwx,g=rx,o=rx

I'm often confounded by Unix file permission. Do I even have a right plan? I'm using Debian lenny.

View 4 Replies View Related

Ubuntu Servers :: Lucid X86 Installation Disk - Gets To 17% Copy On Fs-core-modules-2.6.32.21-generic-di And Hangs

Apr 30, 2010

I downloaded the x86 server version for Lucid twice today. Both times before burn the md5 match those published on the Ubuntu site. I am attempting to install the system on a Dell poweredge 2500. 2x 1.4 gb P4 procs, 1 gb ram, 750 GB HDD (raid) Boot to installer. it goes through the standard language checks, keyboard, checks for cdrom, then attempts to start copying files.

It gets to 17% copy on fs-core-modules-2.6.32.21-generic-di and hangs there for 5 minutes or so. Then comes back with the error that it could not get the file and asks if I want to retry. all retries lead back to this error. As I said, MD5 is exact, burner does not complain of a bad burn, and disk is closed at the end of the burn. so, has anyone else been able to install Lucid server x86? burned four disks today, one pair on two different burners. All fail at 17% retrieving that file.

View 9 Replies View Related

Fedora :: Generic Kernel Build For Separate Box?

Apr 2, 2010

I'd like to compile a generic kernel for my netbook on my desktop. They are both F12 64bit. On my desktop can I do:

make xconfig
make
make modules_install

Then copy the folder to my netbook then:

make install? Is there a better way? I don't really want to make .rpms.

View 1 Replies View Related

Debian Multimedia :: Gnome 2.30 Build - LibIDL Make Error

Apr 7, 2010

Did not find much here regarding building Gnome 2.30 from source. I'm using jhbuild to build the gnome 2.30 desktop. I have everything, to my knowledge, installed to build gnome. I get an error when trying to build the libIDL library. Anyone have any clue as to what I need installed or changed in the configuration file to build libIDL?

View 1 Replies View Related

General :: What Does 'make' And 'make Modules'

Feb 20, 2010

In linux kernel compilation steps what is difference in the functionality of 'make' and 'make modules' with respect to file system

View 3 Replies View Related

Ubuntu :: Installing Emacs 23.1 - Error "makeinfo Is Missing - Cannot Build Manuals Make: *** [info] Error 1 **** Installation Failed"

Feb 6, 2010

I've been trying to install the latest version of Emacs from source but I'm running into a trouble. The commands "./configure" and "make" work just fine. However, when I run "sudo checkinstall" I get a message saying that makeinfo is missing:

Code: makeinfo is missing - cannot build manuals make: *** [info] Error 1 **** Installation failed. Aborting package creation. Cleaning up...OK Bye. What is Error 1

View 4 Replies View Related

Ubuntu :: Make With Make File Yields Error - /usr/bin/javac: Cannot Execute Binary File

Nov 17, 2010

When I try to compile some Java code on Ubuntu 10.10 (kernel 2.6+) using make and a Makefile.

I get an error indicating that the make utility cannot execute the java compile command (javac).

The error reads: /bin/bash: line 6: .: /usr/local/jdk1.5.0_18/bin/javac: cannot execute binary file

I am executing make as root. I have enabled permissions on all directories in the path /usr/local/jdk1.5.0_18/bin/javac and on javac itself.

I get this error whether using a jdk installed via ubuntu apt-get, or whether I install the jdk myself. And I get it using either Java 1.5 or 1.6

My machine has an 80386 processor. I notice the make utility is built for i686-pc-linux-gnu

However, I can manually compile using javac.

I can compile calling javac from within a bash script.

I can compile using the java compiler gcj from the command line: gcj --main=HelloWorld HelloWorld.java -o HelloWorld.exe

But I cannot compile java code from the makefile. Any reasons why I might be getting this error?

View 4 Replies View Related







Copyrights 2005-15 www.BigResource.com, All rights reserved