Fedora :: Error Calling Another Java Class

Feb 4, 2011

I have a simple code like below. when I run this command javac callSMSClient.java I get this erros. Any solution to this please?

View 13 Replies


ADVERTISEMENT

Debian :: Java Error - Class Applet GUI Not Found

Mar 7, 2010

I have Debian Testing, Kernel 2.6.32-trunk-686 and Java version:
java version "1.6.0_16"
Java(TM) SE Runtime Environment (build 1.6.0_16-b01)
Java HotSpot(TM) Server VM (build 14.2-b01, mixed mode)

If I open web page with Java application (in Opera, Iceweasel and Google Chrome), for example this page: [URL] I get error message (image in attachment). If I click in the Details, I get this text:
Java Plug-in 1.6.0_16
Using JRE version 1.6.0_16-b01 Java HotSpot(TM) Server VM
User home directory = /home/johnnycage
c:clear console window
f:finalize objects on finalization queue
g:garbage collect
h:display this help message
l:dump classloader list
m:print memory usage
o:trigger logging
q:hide console
r:reload policy configuration
s:dump system and deployment properties
t:dump thread list
v:dump thread stack
x: clear classloader cache
0-5: set trace level to <n>

load: class AppletGui not found.
java.lang.ClassNotFoundException: AppletGui .....
Exception: java.lang.ClassNotFoundException: AppletGui

View 4 Replies View Related

Programming :: Calling C Ece From Java Source

Aug 13, 2010

I want to call c exe from java source code and i want to interact with the c program during it's execution, i am able to send the parameters to c program but i am not able to interact with it.

View 3 Replies View Related

Programming :: How To Set Up Global Class In JAVA?

May 10, 2011

I've had to do some code in java, a language I'm very much unfamiliarly with so please excuse my incorrect use of terms. The basic outline of my problem is I create a class object as a local within a swing button function it works fine. If I create it as a global ( with I think I need to do ) within main, then prototype it with the other swing objects at the bottom of the file when it is called it causes a host of problems. I think the easiest way is to show it.

View 2 Replies View Related

Programming :: Md5 In Java Without Using MessageDigest Class

Sep 18, 2010

I am looking to write a function to return an MD5 hash in Java but I don't want to us the MessageDigest class as I am using the J2ME framework which doesn't include it.

View 3 Replies View Related

Ubuntu :: Cannot Execute Java Class File In 9.10

Mar 20, 2010

I installed jdk1.6.0_18 version. Please see below for the version.

[Code].....

View 1 Replies View Related

Software :: Set Class Path For Java In Ubuntu 9.10

May 24, 2010

I recently installed java in ubuntu (ver#java1.6.0.00)with many pains.Now I need a clear class path for this java in ubuntu 9.10.

View 2 Replies View Related

Debian Programming :: Java Can't Find Main Class

May 18, 2010

This is a bit of revision for the OU course M257

Code: Select all import java.util.*;
public class FindDupes {
public static void main(String[] args) {
   Set<String> orig = new HashSet<String>();
   Set<String> dupe = new HashSet<String>();
   for(String a: args)
   if(!orig.add(a))
      dupe.add(a);

   orig.removeAll(dupe);
   System.out.println("words " + orig);
   System.out.println("dudes " + dupe);
}
}

for some reason it will compile but not run on debian lenny complains it can't find the main class but it compiles and runs without problem on Fedora 12.

View 6 Replies View Related

General :: Convert Java Class Into Jar Archive In (Redhat)?

Jun 7, 2011

I need to know that how to convert a java class file into java archive (jar)

View 1 Replies View Related

Ubuntu Security :: Malware-gen In Class Files With Latest Java?

Apr 4, 2011

I browse with Firefox and I had been running a pretty vanilla install of Ubuntu 10.4 (with a few things like tomcat and mysql) I supposed the repos kept everything (like java) up to date.

Some time ago I replaced OpenJDK with SunJDK.
java -version is "1.6.0_24"
which java is /usr/bin/java

Yesterday, for the first time, I downloaded and ran an Avast! scan. It complains of "Malware-gen" in several class files in what I think is the java cache. Does anyone know how this could be?

View 2 Replies View Related

Fedora Installation :: Error Type: <class 'yum.Errors.ConfigError'>

May 2, 2009

i get this error when trying to update/install programs and fedora 10

Code:
Error Type: <class 'yum.Errors.ConfigError'>
Error Value: File contains no section headers.

i also get this when i run yum update:

Code:
bash-3.2$ yum update
Loaded plugins: protectbase, refresh-packagekit
Config Error: File contains no section headers.
file: file://///etc/yum.repos.d/rpmfusion-nonfree.repo, line: 2
'protect=yes

[Code]...

View 4 Replies View Related

Software :: Set Mail.jar - JavaMail - And Mysql-connector-java.jar In Class Path

Jan 18, 2010

I want to ask how i set Linux class path for mail.jar and mysql-connector.jar. I have set the class path for java with the command.

Code:

when i do java -version it's work fine.

Also if i want to know that what shell i am using how can i find it.Also what is the command for showing class path variables or how can i see my JAVA_HOME class path.Means after setting the class path for above two files how can i see that these files have added.

When i write echo $CLASSPATH or echo $JAVA_HOME it shows nothing no error but again shows the prompt.

One thing more i want to run a java program on Linux it is in a package (named asteriskproject). It consist of 10 java files. I have run this program on windows using netbeans IDE.For this program i need to set my Linux class path for the above mentioned files, and this is my first time that i am running any program on Linux. So i want to ask how can i run my program. Simply put this asteriskproject directory in any folder and run the main file using javac. Is it right way to run the program that consist of package ?

View 3 Replies View Related

Fedora :: Update 12 On AO D250 - Error Type: <class 'yum.Errors.RepoError'>

Apr 5, 2010

I installed Fodora 12 on my aspire one EEEpc, I was trying to do a software update but i get an error: Code: An internal system error has occurred a problem that we were not expecting has occurred. Please report this bug in your distribution bugtracker with the error description more details: Error Type: <class 'yum.Errors.RepoError'>

[Code]...

View 2 Replies View Related

Programming :: Replacing The File In .Jar - Java.lang.NoClassDefFoundError Exception At Main Class

Jul 21, 2010

working on a script to update .Jar file, I have tried jar xf to unpack and jar cf to repack it is giving me java.lang.NoClassDefFoundError exception at main class. I also tried jar uf, which is also not working for me Basically my jar file requires to update date, which i do from "winrar" Manual it works fine, but now to remove "Donkey work", i want to make an script which does this all automatically, and the last stage is to update jar file which is not happening.

View 1 Replies View Related

OpenSUSE Install :: Cannot Compile Vdrift-2009-06-15 - Warning: The Options Class Is Deprecated; Use The Variables Class Instead

Mar 12, 2010

I have a problem with compiling vdrift-2009-06-15 using scons. As the source that i obtained only supports scons i cannot use make. the error that i get when i try to compile it in GNOME Terminal is: scons: Reading SConscript files ... scons: warning: The Options class is deprecated; use the Variables class instead.
File "/home/mohit/Download/vdrift-2009-06-15/SConstruct", line 9, in <module>

scons: warning: The BoolOption() function is deprecated; use the BoolVariable() function instead.
File "/home/mohit/Download/vdrift-2009-06-15/SConstruct", line 13, in <module>
Checking for C++ header file asio.hpp... (cached) yes
Checking for C++ header file boost/bind.hpp... (cached) yes
Checking for C++ header file GL/gl.h... (cached) yes
Checking for C++ header file GL/glu.h... (cached) yes
Checking for C++ header file SDL/SDL.h... (cached) yes
[Code]........

View 4 Replies View Related

Slackware :: Installing Java Error - When Trying To Run A Java App With The Firefox Plugin - Browser Crashe

May 29, 2011

Code: ~ $ /usr/java/jre1.6.0_25/bin/java -showversion Error occurred during initialization of VMjava/lang/NoClassDefFoundError: java/lang/Object

That's the error I get. When trying to run a java app with the firefox plugin, the browser simply crashes if it's the 64bit java or tells me it's not installed if it's the 32bit version.

I'm at a loss as to what to do. I think it has something to do with leftover gunk from a previous version I misinstalled(Is that even a word?) Anyway, the only thing that google could come up with was a solution for windows which laid blame on Bill Gates for having a bunch of pf (java prefetch) files stuffed into c:windows for no apparent reason. The solution was to delete them, but I can't seem to find the java prefetch folder in linux. The method I used is downloading the rpm from java.com the rpm2tgz then installpkg then cp libnpjp2.so to firefox plugins folder.

View 8 Replies View Related

General :: Error While Calling Capget Function (EINVAL)?

Apr 27, 2011

Error while calling capget function (EINVAL)

View 1 Replies View Related

Applications :: Wrong ELF Class / 64BITS App Error?

Mar 6, 2010

Trying to run Secondlife-i686-1.23.5.136262 app on Ubuntu 9.10 64 BitS I get

./secondlife/

64-bit Linux detected: Disabling GStreamer (streaming video and music) by default; edit ./secondlife/ to re-enable.

Running from /home/pbureau/Downloads/SecondLife-i686-1.23.5.136262

/usr/lib/gio/modules/libgiogconf.so: wrong ELF class: ELFCLASS64 Failed to load module: /usr/lib/gio/modules/libgiogconf.so
/usr/lib/gio/modules/libgioremote-volume-monitor.so: wrong ELF class: ELFCLASS64 Failed to load module: /usr/lib/gio/modules/libgioremote-volume-monitor.so
/usr/lib/gio/modules/libgvfsdbus.so: wrong ELF class: ELFCLASS64 Failed to load module: /usr/lib/gio/modules/libgvfsdbus.so
code....

View 9 Replies View Related

General :: Error Type: <class 'yum.Errors.RepoError'>

Feb 26, 2010

On a fresh install of Fedora 12: I am trying to do a software update and keep getting these errors. I am new to Fedora but have used Ubuntu for some time. An Internal system error has occurred:

Under more details it states:

Error Type: <class 'yum.Errors.RepoError'>
Error Value: Error getting repository data for installed, repository not found
File : /usr/share/PackageKit/helpers/yum/yumBackend.py, line 3125, in <module>
main()
File : /usr/share/PackageKit/helpers/yum/yumBackend.py, line 3122, in main

[Code]...

View 1 Replies View Related

Programming :: Compilling C++ Source Code (class) Error?

Feb 24, 2011

please i try to compile the below code on ubuntu with g++ but i was getting an error message

fig03_05.cpp:10: error: new types may not be defined in a return type
fig03_05.cpp:10: note: (perhaps a semicolon is missing after the definition of �GradeBook�)
fig03_05.cpp:32: error: two or more data types in declaration of �main�

[code]...

View 7 Replies View Related

Programming :: Linker Error For A Singleton Class Program

May 5, 2011

I am getting a linker error for a simple program to represent a singleton class.

Find below the program which I have written:

View 3 Replies View Related

Red Hat / Fedora :: Java Memory Error / Xms256m -Xmx1024m Not Working?

Apr 6, 2011

I am using Centos, in that i am executing normal stand alone java programs. Some time i am getting "java.lang.outofmemory heap space" error. how to increase the heap size. I tried with the command java -Xms256m -Xmx1024m but its not working for me.

View 6 Replies View Related

Networking :: Openldap Upgrade From 2.3.32 To 2.4.23 - Error 'no Structural Object Class Provided'

Aug 17, 2010

Currently I have a single openldap server version 2.3.32 preforming authentication on our databases as well as e-mail and other assorted programs. When we get a high volume of users, sometimes the users can not be authenticated for new e-mail sessions and what not. We have traced it back to being that our current single ldap server can not authenticate them all in a timely manner. We decided that we would put up a new ldap server and replicate the changes to it, then upgrade the older server version and replicate back to it so that both would have a current up to date copy of our configuration, and we would do a master/slave type setup.

Trying to replicate between the old server and the new server is not currently working. Here is the issue: when we try to import the schema's from the older server we get this error: slapadd: dn="cn=Domain Users,ou=Groups,dc=mydomain,dc=com" (line=247): (65) no structural object class provided I can not seem to find any information on google that shows this exact error? if this isn't detailed enough let me know what else I should post.

View 1 Replies View Related

General :: Error Calling Get_folders: Launch Helper Exited With Unknown Return Code 1

Jul 18, 2010

hi..
I'm using ubuntu 10.04 and whenever i start nautilus from command line it shows error:

Code:
root@aduait-laptop:~/Desktop# nautilus
Initializing nautilus-gdu extension
** (nautilus:9990): WARNING **: Error calling get_folders: Launch helper exited with unknown return code 1
** (nautilus:9990): WARNING **: Error calling get_folders: Launch helper exited with unknown return code 1
** (nautilus:9990): WARNING **: Error calling get_folders: Launch helper exited with unknown return code 1
** (nautilus:9990): WARNING **: Error calling get_folders: Launch helper exited with unknown return code 1
** (nautilus:9990): WARNING **: Error calling get_folders: Launch helper exited with unknown return code 1

View 5 Replies View Related

OpenSUSE :: FireFox 5.0 - With IcedTea - Plugin Error: "Failed To Run /usr/lib64/jvm/java-1.6.0-openjdk/jre/bin/java"

Jul 10, 2011

I use openSUSE 11.4 64 bits, KDE and FireFox 5.0. I regularly update. When trying to reach my bank, I get the following error: Code: icedteanp plugin error: Failed to run /usr/lib64/jvm/java-1.6.0-openjdk/jre/bin/java. For more detail rerun "firefox -g" in a terminal window. Is there anything I can do to remediate ? Does IcedTea everything that Java does?

View 4 Replies View Related

General :: Error 'Method "curlQuery" Of Class "Twitter" Reported An Error: CURL Library Not Installed

Jan 19, 2010

I am installed cUrl from http://packages.ubuntu.com/lucid/amd64/curl/download for my ubuntu 9.0 with php 5.2 ,Apache 2.0.It was installed by gkebi package installer. but when i display phpinfo() curl not found since i was attempt to use phptwitter class. what is the proble i have? When i am trying to install again package installer shows same version of curl already found, but phptwitterclass shows following error 'Method "curlQuery" of class "Twitter" reported an error: CURL library not installed.'

View 1 Replies View Related

OpenSUSE :: Java App Error: "java.lang.NullPointerException"

Feb 23, 2011

i try to open a java app, the launch proceeds as far as the final stages, but then stops to do the final sequences showing the error msg listed above.

View 3 Replies View Related

Ubuntu :: Evolution Error Object Class EMFolderTree Doesn't Implement Property 'paste-target-list' From Interface 'ESelectable'

May 24, 2011

When I start evolution from the terminal I get this: (evolution:3265): GLib-GObject-CRITICAL **: Object class EMFolderTree doesn't implement property 'paste-target-list' from interface 'ESelectable' The program still starts though. I am fairly new to Ubuntu.

View 2 Replies View Related

Fedora :: Cfg80211: Calling CRDA For Country: MX?

Sep 14, 2009

Browsing thru the dmesg output, I saw this:

cfg80211: Calling CRDA for country: MX
cfg80211: Regulatory domain changed to country: MX
(start_freq - end_freq @ bandwidth), (max_antenna_gain, max_eirp)
(2402000 KHz - 2472000 KHz @ 40000 KHz), (300 mBi, 2700 mBm)

[code]....

Wireless works fine, but I'm not currently in Mexico, so where is this coming from?

View 1 Replies View Related

Ubuntu :: Calling Functions "command Not Found" Error?

Jan 20, 2011

I wrote the following script to organize my music files and to learn a bit more about bash.

My problem is, now that I'm almost over the first version, that functions which are surely spelled correctly and were recognized in the past, are giving me the "command not found" error!

Code:
#!/bin/bash
# This is a script for moving tagged files into organized directory trees.
##### Variables
filenum=0

[Code]....

View 4 Replies View Related







Copyrights 2005-15 www.BigResource.com, All rights reserved